program: Gaussian 09
title: 000052656
version: EM64L-G09RevD.01
frameworkgroup: C1[X(C22H29NOS)]
method: RPBEPBE
basis: SDD
operation: Freq
keyword: #p
keyword: freq=noraman
keyword: PBEPBE/SDD
title: #p freq=noraman PBEPBE/SDD
converged: NO YES NO NO
title: Mulliken charges:
elementType: S O N C C C C C C C C C C C C C C C C C C C C C C H H H H H H H H H H H H H H H H H H H H H H H H H H H H H
charge: 0.291282 -0.456533 -0.077578 -0.087379 -0.082635 -0.474893 -0.419969 -0.469321 -0.421891 -0.382296 -0.403715 -0.388041 -0.476637 0.388306 -0.606012 -0.291501 0.479939 -0.287091 -0.416411 -0.379494 -0.141818 -0.522121 -0.227462 -0.230704 -0.244590 0.197254 0.199837 0.206531 0.210566 0.208590 0.193966 0.209821 0.206091 0.194764 0.211796 0.177030 0.187776 0.207113 0.168940 0.211298 0.215111 0.236158 0.204046 0.209210 0.234300 0.341034 0.244049 0.225674 0.260778 0.241697 0.261775 0.219796 0.220397 0.223166
chargesum: 0.00000
title: Mulliken charges with hydrogens summed into heavy atoms:
elementType: S O N C C C C C C C C C C C C C C C C C C C C C C
charge: 0.291282 -0.115499 -0.077578 0.109875 0.117202 -0.057796 -0.017412 -0.053409 -0.015331 -0.017491 -0.027662 0.038368 -0.036433 0.388306 -0.162502 -0.291501 0.479939 -0.043041 -0.190737 -0.118715 0.099879 -0.260346 -0.007666 -0.010307 -0.021425
polarizability: 3.08454314e+02 -8.64213653e+00 2.26170663e+02 1.54396305e+01 2.00368974e+01 2.10792514e+02
1716.lowfreq: -20.9212 -7.7461 -5.0555 -0.0005 0.0012 0.0014 11.5405 16.8380 23.5666
frequency: 6.3464 14.1429 23.1756 33.3115 34.3610 37.0717 47.0149 66.2637 93.7743 124.0996 134.4344 167.8129 184.6988 221.2129 231.8572 242.3232 269.8513 276.7601 308.7527 323.3114 329.7007 345.8482 365.8247 373.5743 379.7001 404.0363 407.3633 428.5005 450.9227 468.9236 495.1387 515.8133 547.1711 556.5779 584.5212 617.4393 623.1413 643.7997 682.2741 692.6405 700.9667 702.8338 747.3678 758.9834 768.3324 774.4924 788.9344 810.7296 811.1380 817.1386 829.3240 837.7094 842.3273 851.4469 865.2369 883.9987 905.8067 910.0056 920.5160 939.2885 957.6031 961.7312 966.5888 974.6196 984.6612 990.6818 992.5755 1003.5803 1009.7304 1028.1210 1044.6210 1057.3937 1072.8323 1079.6083 1083.4893 1088.3776 1091.9573 1102.9477 1114.6204 1139.2012 1147.6393 1164.7201 1166.9415 1170.7047 1187.7599 1201.6084 1206.3176 1209.2459 1219.5644 1221.5270 1233.9741 1240.7346 1242.0008 1264.8883 1282.1679 1288.1115 1300.7694 1302.1205 1312.4818 1317.8245 1319.4442 1324.4940 1329.4995 1330.3817 1337.7931 1345.0023 1354.2928 1355.3245 1365.6139 1368.9518 1384.4238 1390.3180 1440.4149 1448.6486 1457.9207 1459.3656 1464.0555 1468.9016 1470.6012 1473.1631 1475.9721 1484.4288 1488.5726 1492.9893 1542.8375 1592.9869 1614.8924 2817.0386 2826.1305 2856.6693 2957.8122 2963.7341 2969.3398 2980.1384 2986.4456 2991.6191 2996.7077 3002.8436 3006.6255 3011.7743 3012.9473 3018.8733 3031.2874 3041.2841 3053.2821 3058.3642 3066.0067 3114.5542 3123.0302 3136.9201 3152.1219 3159.0685 3164.5279 3179.3798 3234.1147 3541.4375
redmass: 3.5192 4.2514 4.1752 4.1330 2.0545 4.5936 6.9747 4.5310 3.6620 4.3369 3.4191 4.7013 4.7837 1.8351 4.0375 3.7179 4.9878 2.1719 2.5875 2.4395 2.9490 2.3248 2.0261 1.3557 2.1099 2.8115 3.3901 3.3299 4.1464 3.6589 4.6011 3.4371 4.6160 3.2277 3.9354 6.2323 6.5904 4.3149 3.8317 2.0870 1.8181 1.6546 3.7211 2.0437 1.3791 1.8774 2.0881 1.8250 2.7219 3.7669 1.3526 2.9085 3.0534 1.2503 2.5483 2.3577 1.3713 1.6140 2.0942 1.9603 2.6356 2.1650 2.3598 1.3913 2.3737 4.3197 1.4427 2.5296 2.4392 2.1613 2.3704 1.9668 2.1360 1.5664 1.7259 1.4374 1.9889 1.7250 1.9782 1.7808 2.0164 1.1142 1.8510 1.0850 1.1221 1.1883 1.3322 1.3299 2.3614 1.4322 1.1653 1.3081 1.2990 1.2593 1.3861 1.3933 1.4549 1.3850 1.7736 1.6269 1.5511 1.4742 1.5610 1.3264 1.7552 1.4231 1.3689 1.4258 1.3667 1.3814 7.2612 1.3950 2.1265 1.1197 1.0775 1.0768 1.1081 1.1178 1.0907 1.1238 4.6170 2.3449 1.0897 1.0906 5.6498 6.0457 6.1586 1.0719 1.0704 1.0699 1.0719 1.0772 1.0616 1.0727 1.0633 1.0594 1.0732 1.0805 1.0673 1.0843 1.1005 1.0865 1.0982 1.1025 1.1025 1.1012 1.1015 1.0855 1.0874 1.0931 1.0963 1.0906 1.0997 1.0965 1.1001 1.0656
irintensity: 0.1184 0.0254 0.0040 0.0864 0.0853 0.1865 0.4066 0.2303 0.4080 0.3899 3.4268 0.9596 3.4872 0.0015 0.1221 0.1468 6.8502 0.2953 4.8247 5.6323 2.1749 0.2061 22.3468 94.1878 59.1095 0.1098 1.7748 4.8562 3.5924 2.9785 0.3283 0.1951 14.3636 14.8985 2.3401 0.1135 3.2584 9.6298 10.0954 49.0208 61.0132 74.2089 0.6001 30.5662 0.4569 1.1129 0.5226 28.6977 2.0382 3.5258 19.9357 15.3302 8.5538 0.7263 0.8037 0.0146 1.9625 3.1384 0.6578 8.9957 12.2410 0.3769 8.7227 0.8031 19.2442 2.4125 0.2843 16.0650 0.9116 8.8807 1.7037 3.6007 10.8426 3.1923 3.8723 5.4768 18.5421 19.6903 18.2287 47.3933 12.0159 2.3684 4.0391 0.2653 0.6570 1.1428 1.7851 7.3171 2.8102 22.9930 0.8589 15.5627 1.5803 25.2326 5.7088 7.4720 13.6983 6.2432 0.4414 3.6486 4.4185 7.0937 4.1733 0.2292 10.2973 4.7077 23.0985 0.6903 1.3212 7.0645 0.1419 2.6709 7.7335 2.8691 1.4964 1.3694 24.1597 13.6001 3.0062 20.1626 2.6350 18.2434 9.2343 5.6531 0.5837 0.8907 6.2282 50.5131 113.5857 126.3638 0.4195 1.7871 3.0373 113.3122 99.5950 19.8282 128.4182 69.1583 37.7005 12.2243 5.5097 24.2304 4.4776 71.9345 2.6149 87.3171 41.0943 5.9940 2.1863 35.2453 34.3716 9.0455 13.9443 6.8739 1.1717 5.5514
temp: 298.150 k
press: 1.00000 atm
elementType: 16 8 7 6 6 6 6 6 6 6 6 6 6 6 6 6 6 6 6 6 6 6 6 6 6 1 1 1 1 1 1 1 1 1 1 1 1 1 1 1 1 1 1 1 1 1 1 1 1 1 1 1 1 1
symmnumber: 1
zpe: 1206323.1 jmol-1
zpe.correction: 0.459464 hartree
zpe.thermalcorrener: 0.483265 hartree
zpe.thermalcorrenthalpy: 0.484209 hartree
zpe.thermalcorrgfe: 0.401223 hartree
zpe.sumelectzpe: -1381.851794 hartree
zpe.sumelectthermal: -1381.827993 hartree
zpe.sumelectthermalent: -1381.827049 hartree
zpe.sumelectthermalfe: -1381.910035 hartree
dipole: 1.9926 1.7995 0.3231
dipole: 2.7042
quadrupole: -156.0855 -156.3166 -152.7742
quadrupole: -4.5774 -0.2501 3.6723
quadrupole: -1.0267 -1.2578 2.2846 -4.5774 -0.2501 3.6723
hfenergy: -1382.3112583 hartree
pointgroup: C01 [X(C22H29N1O1S1)]
dipole: -0.7865083 -0.6657122 0.2648514 debye
polarizability: 307.4919163|-12.7526405|219.205693|-15.9894269|-21.0050503|218.719882 unknown
InChI: InChI=1S/C22H29NOS/c24-22(21-7-4-14-25-21,15-18-5-2-1-3-6-18)12-13-23-16-19-8-9-20(17-23)11-10-19/h1-7,14,19-20,24H,8-13,15-17H2
charge 0 multiplicity 1
54 atoms
S  2.697201 -1.881021 -1.023509
O  1.348435 0.712579 -1.782061
N  -2.786357 0.278474 -0.371069
C  -4.461591 -0.314796 1.460457
C  -5.222857 0.713794 -0.986236
C  -5.671928 -1.065645 0.843745
C  -4.742256 1.209655 1.514161
C  -6.110382 -0.47488 -0.53275
C  -5.159726 1.796006 0.123378
C  -3.113223 -0.631797 0.749732
C  -3.799882 0.28456 -1.452604
C  -1.403697 0.089449 -0.875433
C  -0.356391 0.771031 0.033242
C  1.1197 0.439416 -0.336598
C  2.058181 1.45366 0.400041
C  1.457786 -1.008779 -0.022879
C  3.55228 1.220335 0.256105
C  1.00278 -1.829412 1.001524
C  4.303349 0.664557 1.322934
C  4.229321 1.563834 -0.943411
C  1.599297 -3.143495 1.018594
C  2.515272 -3.341167 -0.001293
C  5.695242 0.452311 1.198568
C  5.620078 1.353088 -1.071581
C  6.359225 0.797057 -0.000994
H  -4.350295 -0.68427 2.501419
H  -5.710804 1.158711 -1.878509
H  -6.515301 -1.00791 1.559489
H  -5.421068 -2.139996 0.747095
H  -3.841864 1.732409 1.885438
H  -5.547659 1.38647 2.25471
H  -6.098425 -1.257372 -1.316299
H  -7.156885 -0.117546 -0.468324
H  -6.156494 2.274066 0.20064
H  -4.444986 2.582208 -0.180307
H  -3.122755 -1.704534 0.417394
H  -2.297788 -0.541145 1.492379
H  -3.445477 1.008822 -2.211427
H  -3.87651 -0.711689 -1.965087
H  -1.153845 -0.995394 -0.997077
H  -1.34685 0.552543 -1.8787
H  -0.495393 1.865265 -0.037876
H  -0.53044 0.496987 1.090206
H  1.774006 1.436216 1.468794
H  1.789475 2.449626 -0.001012
H  0.893525 0.00826 -2.312547
H  0.252596 -1.511845 1.730737
H  3.793099 0.390543 2.254862
H  3.653718 1.980423 -1.776341
H  1.349174 -3.910103 1.75633
H  3.10461 -4.22667 -0.233424
H  6.259125 0.020923 2.03377
H  6.127966 1.622934 -2.004864
H  7.439089 0.636856 -0.099729
