program: Gaussian 09
title: 000052617
version: EM64L-G09RevD.01
frameworkgroup: C1[X(C12H6N2S2)]
method: RPBEPBE
basis: SDD
operation: Freq
keyword: #p
keyword: freq=noraman
keyword: PBEPBE/SDD
title: #p freq=noraman PBEPBE/SDD
converged: NO NO NO NO
title: Mulliken charges:
elementType: S S N N C C C C C C C C C C C C H H H H H H
charge: 0.147436 0.147438 0.322373 0.322372 0.269501 0.269502 0.325998 0.326000 -0.417314 -0.417311 -0.405280 -0.405280 -0.210559 -0.210562 -0.791263 -0.791265 0.256837 0.256836 0.260486 0.260485 0.241785 0.241785
chargesum: 0.00000
title: Mulliken charges with hydrogens summed into heavy atoms:
elementType: S S N N C C C C C C C C C C C C
charge: 0.147436 0.147438 0.322373 0.322372 0.269501 0.269502 0.325998 0.326000 -0.160477 -0.160475 -0.144795 -0.144794 0.031226 0.031223 -0.791263 -0.791265
polarizability: 4.18545612e+02 -3.17214863e+01 1.76832970e+02 1.41498200e-03 4.54646771e-03 6.22402991e+01
1716.lowfreq: -2.6075 -0.0015 -0.0003 0.0006 1.6534 9.0362 12.8880 24.6105 26.8504
frequency: 9.3398 24.6069 25.7010 74.1985 139.9522 176.2509 241.7428 253.3374 266.7815 294.8605 360.0391 368.8229 400.5832 413.5875 421.0646 421.7724 466.9450 513.4499 525.1172 546.5051 561.7266 584.6071 682.0999 691.7798 742.6799 782.2882 786.1030 803.1724 839.4045 889.1448 917.7929 920.5840 986.1114 988.2460 993.7395 1075.1904 1082.0936 1154.3490 1189.6457 1197.1846 1252.1914 1272.4889 1283.5879 1352.0641 1403.9096 1415.7472 1422.3953 1454.8367 1515.7033 1578.0833 1584.2927 1612.7328 2187.6540 2196.9480 3146.6244 3146.9066 3162.3204 3163.1672 3175.9710 3176.8075
redmass: 16.9573 14.6375 9.7815 8.1122 7.1750 4.0688 5.2530 8.0171 16.7890 5.0486 7.9352 10.2538 11.7539 10.7168 10.9358 10.8379 3.3083 7.1828 5.3556 5.3205 8.1930 3.1195 4.7566 9.8049 1.5085 5.7442 7.4055 1.2767 3.1931 6.1847 1.3820 1.4473 1.3548 1.3457 6.4062 2.3334 1.8368 1.6688 1.2089 1.5005 1.9423 3.2783 2.2402 4.9989 2.4187 7.3759 2.9357 2.6154 4.5726 5.2200 7.6220 6.7048 12.8887 12.8881 1.0867 1.0867 1.0922 1.0924 1.0997 1.0994
irintensity: 0.5574 0.9053 0.0036 0.0038 1.1146 2.3436 0.0236 6.6500 0.0000 2.3595 0.0018 3.2087 0.9050 0.0617 1.2624 1.6397 0.0002 0.0000 0.0117 2.0357 0.0006 4.5045 0.1079 174.8060 0.0001 0.8900 0.0052 148.8858 0.0026 0.0003 0.0008 2.1179 0.0021 2.5833 42.2876 14.3304 0.0002 0.0004 1.3278 0.0001 7.4054 0.0064 0.3985 21.4290 0.0000 0.0000 67.3489 0.0016 64.3827 42.1689 0.0026 0.0001 3122.4631 0.0006 11.7487 0.0016 0.0001 9.4357 20.8893 0.0003
temp: 298.150 k
press: 1.00000 atm
elementType: 16 16 7 7 6 6 6 6 6 6 6 6 6 6 6 6 1 1 1 1 1 1
symmnumber: 1
zpe: 384701.3 jmol-1
zpe.correction: 0.146525 hartree
zpe.thermalcorrener: 0.160174 hartree
zpe.thermalcorrenthalpy: 0.161118 hartree
zpe.thermalcorrgfe: 0.101949 hartree
zpe.sumelectzpe: -1365.453747 hartree
zpe.sumelectthermal: -1365.440098 hartree
zpe.sumelectthermalent: -1365.439154 hartree
zpe.sumelectthermalfe: -1365.498323 hartree
dipole: 0.0000 0.0000 -0.0094
dipole: 0.0094
quadrupole: -136.0453 -90.6718 -109.7752
quadrupole: 3.6063 0.0000 0.0008
quadrupole: -23.8812 21.4923 2.3889 3.6063 0.0000 0.0008
hfenergy: -1365.6002717 hartree
pointgroup: C01 [X(C12H6N2S2)]
dipole: 0.0000011 0.0000006 0.0037024 debye
dipolederiv: -1.3657232 -0.405424 -0.0011846 -0.5877005 -0.2381453 -0.0002126 0.0263268 0.0084397 -0.0555242 -1.3657597 -0.4054248 0.0011879 -0.5876383 -0.2381193 0.000214 -0.0263137 -0.0084354 -0.0555238 -2.5232028 -0.7773512 0.0032112 -0.9280357 -0.4467632 0.0018518 -0.018042 -0.0071395 -0.0026674 -2.5232382 -0.7773285 -0.0032052 -0.9280464 -0.446752 -0.0018359 0.0180958 0.0071725 -0.002669 -0.2411626 -0.1521897 0.0008059 -0.1259249 0.0496211 -0.0002061 0.0009746 0.0013033 0.0241979 -0.2411651 -0.152186 -0.0008013 -0.1259289 0.0496203 0.000203 -0.0009725 -0.0013103 0.024198 1.4982445 0.3654997 -0.005924 0.487432 0.2948111 -0.0031552 0.0041904 0.0013121 0.0782627 1.4982575 0.3654948 0.0059385 0.4874377 0.294815 0.0031529 -0.0041977 -0.0013219 0.0782629 -0.1629939 0.0440123 -0.0006299 -0.072739 -0.0862102 0.0002978 -0.0003786 0.0001511 -0.1489291 -0.1629927 0.0440131 0.0006285 -0.0727327 -0.0862136 -0.0003062 0.0003767 -0.0001596 -0.148929 -0.1148795 -0.0669374 0.00056 -0.2690848 -0.1309833 0.0012658 0.0008045 -0.0002839 -0.1570812 -0.1148825 -0.0669376 -0.0005497 -0.2690861 -0.1309832 -0.0012767 -0.0007802 0.0002839 -0.1570817 0.0213151 0.0303004 0.0010107 0.2113393 0.1595618 -0.0000964 0.0014253 -0.0004934 -0.1439242 0.0213139 0.0303001 -0.0010051 0.2113358 0.1595626 0.0000827 -0.0014318 0.0004739 -0.1439245 2.8615052 0.9815178 0.0036418 1.2687823 0.3681909 0.0007572 -0.0122006 -0.0028658 -0.083445 2.8615663 0.9814954 -0.0036683 1.2687232 0.3681518 -0.0007712 0.0121371 0.0028408 -0.0834441 -0.0045175 -0.0770421 0.0000056 -0.0483925 0.0638953 0.0001028 -0.0001478 -0.0000701 0.1576153 -0.0045176 -0.0770427 -0.0000062 -0.0483952 0.0638952 -0.0000967 0.0001489 0.0000765 0.1576148 -0.0324437 0.0751849 -0.0000502 0.086328 0.0626047 0.0000093 0.00047 0.0001448 0.1705159 -0.0324424 0.0751845 0.0000369 0.0863304 0.0626021 0.0000013 -0.0004829 -0.0001365 0.1705163 0.0638592 -0.0175676 -0.0000626 -0.0220018 -0.096581 0.0001878 -0.0000761 0.0003842 0.1609796 0.0638597 -0.0175713 0.00006 -0.0220021 -0.0965808 -0.0001695 0.0000737 -0.0003665 0.1609798 unknown
polarizability: 403.7554696|66.0489883|191.6231127|0.0020791|-0.0042837|62.2402991 unknown
InChI: InChI=1S/C12H6N2S2/c15-7-13-11-5-1-3-9-10(11)4-2-6-12(9)14-8-16/h1-6H
charge 0 multiplicity 1
22 atoms
S  -5.665079 -1.180626 0.12996
S  5.665067 1.180594 0.130014
N  -3.077395 -0.021187 0.128924
N  3.077359 0.021219 0.129039
C  -0.650977 -0.313669 0.124731
C  0.650935 0.31369 0.12473
C  -1.820807 0.544018 0.125361
C  1.820772 -0.543999 0.125475
C  -0.759167 -1.739911 0.124787
C  0.759125 1.739929 0.124694
C  -1.68402 1.94362 0.124998
C  1.683981 -1.943597 0.125215
C  0.3910 -2.534976 0.125177
C  -0.39104 2.534999 0.124972
C  -4.178208 -0.514843 0.112594
C  4.178168 0.514879 0.112673
H  -1.749521 -2.204611 0.12487
H  1.749479 2.204632 0.12478
H  -2.581842 2.568893 0.125078
H  2.581798 -2.568877 0.125374
H  0.305175 -3.626035 0.126268
H  -0.305205 3.626058 0.125987
