program: Gaussian 09
title: 000052612
version: EM64L-G09RevD.01
frameworkgroup: C1[X(C9H17NO2S)]
method: RPBEPBE
basis: SDD
operation: Freq
keyword: #p
keyword: freq=noraman
keyword: PBEPBE/SDD
title: #p freq=noraman PBEPBE/SDD
converged: YES YES NO NO
title: Mulliken charges:
elementType: S O O N C C C C C C C C C H H H H H H H H H H H H H H H H H
charge: 0.969511 -0.529567 -0.546593 -0.327694 -0.053354 -0.460662 -0.448049 -0.363021 -0.382621 -0.379610 -0.560939 -0.419380 -0.387781 0.257866 0.251522 0.199773 0.209820 0.209334 0.256284 0.223594 0.235004 0.195115 0.193443 0.209709 0.285966 0.289765 0.236368 0.248585 0.187291 0.200321
chargesum: 0.00000
title: Mulliken charges with hydrogens summed into heavy atoms:
elementType: S O O N C C C C C C C C C
charge: 0.969511 -0.529567 -0.546593 -0.327694 0.204512 -0.009366 -0.028895 0.116858 0.047497 0.023541 0.014792 0.065573 -0.000169
polarizability: 1.48050255e+02 -1.98227818e-01 1.31960591e+02 2.53454595e+00 1.04468978e+00 1.13930552e+02
1716.lowfreq: -5.7108 -0.0017 -0.0012 0.0019 12.8679 18.3096 44.3936 57.1950 89.9679
frequency: 42.9120 56.9785 89.9442 125.9341 153.4326 177.8569 206.8375 247.7498 263.1819 284.3945 295.1484 351.2997 370.7407 389.4600 431.5841 442.8490 471.5558 490.6875 524.4135 589.8032 649.5375 777.8481 780.4801 802.9705 816.9975 828.5999 861.0978 869.3107 872.7178 907.7265 926.4707 930.2287 950.6368 1005.0807 1013.8985 1028.0746 1048.7939 1052.6033 1080.3857 1090.1838 1114.7633 1129.6220 1137.0459 1155.1632 1174.3000 1216.8954 1241.2669 1249.1876 1255.9432 1267.1617 1296.5225 1314.0122 1328.8106 1336.3085 1338.9761 1342.5254 1352.1822 1353.4933 1370.9774 1423.9955 1450.7596 1455.3216 1459.5080 1464.1839 1468.1196 1469.7081 1483.0896 2914.4699 2926.3637 2958.8041 2977.1449 2980.9283 2986.3319 2995.9533 3022.5594 3027.5453 3030.6551 3043.3430 3044.1411 3054.9513 3060.6579 3063.8420 3092.5466 3163.8722
redmass: 4.2449 3.8780 3.1653 3.5406 4.9027 4.2737 2.9171 2.4523 2.4441 4.0688 3.1336 3.4309 2.8138 3.1493 5.1282 3.5086 3.1500 2.0289 3.5805 3.1327 2.4133 1.9974 1.6036 2.8948 13.6511 1.6167 1.8448 2.1510 2.3153 2.3763 1.6139 2.9396 2.3295 2.4393 2.1247 2.1108 1.4585 1.7739 2.1566 1.8145 1.0420 1.3365 2.1219 1.6385 1.4781 1.2849 1.3013 1.2438 1.2684 1.2950 1.6054 1.3046 1.3119 1.3798 1.4182 1.3723 1.4152 1.4387 1.3638 1.0932 1.0926 1.0858 1.0855 1.0863 1.0821 1.0864 1.0869 1.0687 1.0819 1.0635 1.0603 1.0631 1.0645 1.0635 1.0611 1.0957 1.0987 1.0978 1.1033 1.0899 1.1024 1.0589 1.1034 1.1119
irintensity: 1.4897 2.8347 0.5594 4.8934 2.4657 4.5159 0.8786 3.4314 0.1282 5.6819 8.1222 4.2684 23.4289 4.0880 16.8282 7.4844 18.8149 2.0046 0.8626 36.7976 2.7493 2.0065 0.2848 0.2025 72.9152 3.9036 8.3606 4.2033 9.0399 14.4674 2.4433 63.1590 7.7442 21.2964 11.1186 13.1710 1.9617 2.4571 9.4997 1.4232 1.6904 5.4067 9.2411 7.5120 4.4913 5.6481 6.3583 12.3084 0.8759 1.9767 2.8905 2.7255 0.3119 7.4497 0.8373 3.1114 1.7342 1.1809 19.2798 10.3396 9.8647 4.6511 8.1301 5.5552 11.6152 17.1536 11.7108 53.0730 18.8750 42.4537 11.5101 41.9466 55.7227 26.2212 25.3996 66.7244 40.9536 8.8718 45.7785 16.4973 75.3162 0.9369 13.4031 0.9248
temp: 298.150 k
press: 1.00000 atm
elementType: 16 8 8 7 6 6 6 6 6 6 6 6 6 1 1 1 1 1 1 1 1 1 1 1 1 1 1 1 1 1
symmnumber: 1
zpe: 665688.1 jmol-1
zpe.correction: 0.253547 hartree
zpe.thermalcorrener: 0.266945 hartree
zpe.thermalcorrenthalpy: 0.267889 hartree
zpe.thermalcorrgfe: 0.213673 hartree
zpe.sumelectzpe: -955.196878 hartree
zpe.sumelectthermal: -955.183480 hartree
zpe.sumelectthermalent: -955.182536 hartree
zpe.sumelectthermalfe: -955.236752 hartree
dipole: 0.2066 5.9140 -0.1483
dipole: 5.9195
quadrupole: -79.4332 -89.8961 -92.4828
quadrupole: -11.0169 5.6054 -0.5747
quadrupole: 7.8375 -2.6254 -5.2121 -11.0169 5.6054 -0.5747
hfenergy: -955.450425 hartree
pointgroup: C01 [X(C9H17N1O2S1)]
dipole: 0.008308 2.3283318 0.0504748 debye
polarizability: 148.130803|-0.4303373|131.9610566|1.7852423|-1.1912774|113.8495393 unknown
InChI: InChI=1S/C9H17NO2S/c11-13(12)8-4-7-10(13)9-5-2-1-3-6-9/h9H,1-8H2
charge 0 multiplicity 1
30 atoms
S  1.715596 -0.862471 -0.053938
O  1.515456 -1.951382 1.132693
O  1.976081 -1.379072 -1.585615
N  0.298033 0.456223 0.015068
C  -0.774474 0.09593 -0.977254
C  -1.387143 -1.286759 -0.639749
C  -1.888508 1.181341 -0.920264
C  1.011519 1.738779 -0.250579
C  -2.118256 -1.289746 0.722263
C  -2.611395 1.204158 0.446954
C  3.072093 0.467228 0.396482
C  2.274898 1.751203 0.646518
C  -3.202058 -0.186674 0.784747
H  -0.342036 0.067207 -2.003477
H  -0.612413 -2.075067 -0.66626
H  -2.10257 -1.527895 -1.452188
H  -2.616519 0.92697 -1.716851
H  -1.484352 2.179739 -1.174482
H  0.343232 2.565134 0.047022
H  1.275972 1.87208 -1.325575
H  -1.37646 -1.134713 1.527428
H  -2.575802 -2.283198 0.891727
H  -3.411955 1.968997 0.43145
H  -1.892436 1.494664 1.237884
H  3.706066 0.491608 -0.502211
H  3.598109 0.057142 1.269135
H  2.890803 2.63731 0.411084
H  1.962207 1.808572 1.702628
H  -4.009583 -0.422208 0.059542
H  -3.668906 -0.167099 1.78842
