program: Gaussian 09
title: 000052611
version: EM64L-G09RevD.01
frameworkgroup: C1[X(C17H14NO)]
method: RPBEPBE
basis: SDD
operation: Freq
keyword: #p
keyword: freq=noraman
keyword: PBEPBE/SDD
title: #p freq=noraman PBEPBE/SDD
converged: YES YES NO NO
title: Mulliken charges:
elementType: O N C C C C C C C C C C C C C C C C C H H H H H H H H H H H H H H
charge: -0.193474 -0.069597 -0.502496 0.333380 0.382072 -0.239835 -0.173972 -0.313538 0.136222 -0.346736 -0.366451 0.299766 -0.213269 -0.198194 -0.317245 -0.321897 -0.237128 -0.214475 -0.199968 0.259429 0.295885 0.307237 0.273932 0.273869 0.261424 0.265793 0.267207 0.266418 0.232174 0.283799 0.252905 0.257950 0.258811
chargesum: 1.00000
title: Mulliken charges with hydrogens summed into heavy atoms:
elementType: O N C C C C C C C C C C C C C C C C C
charge: -0.193474 -0.069597 0.052819 0.333380 0.382072 0.067402 0.099959 -0.039669 0.136222 -0.085313 -0.100658 0.299766 0.053938 0.068223 -0.085071 -0.038098 0.015777 0.043476 0.058844
polarizability: 3.46804439e+02 2.50471696e+01 1.67589817e+02 1.26809210e+01 -1.52645980e+00 1.08260221e+02
1716.lowfreq: -6.2238 -1.3056 -0.0009 -0.0008 -0.0005 8.7937 23.2050 35.9293 41.6601
frequency: 23.0827 35.9233 41.6484 74.4636 131.3462 146.1419 156.9372 184.0632 273.7627 275.8637 331.2022 393.1617 395.6856 407.8815 420.0141 442.7763 478.4593 487.5414 498.2190 521.6587 566.9355 609.8436 617.5025 631.2106 662.3836 688.0801 738.6108 757.0008 768.8153 771.9353 774.3901 795.0390 825.3749 851.4250 882.4256 891.9857 910.5807 936.2655 954.6482 962.8680 967.8533 987.8274 988.0002 993.3372 997.9334 1019.6632 1021.0363 1023.4701 1026.4217 1096.0122 1130.8115 1154.1236 1184.3439 1187.6639 1190.4373 1198.3577 1212.0401 1244.4246 1249.3648 1277.0526 1286.1622 1292.8751 1327.0683 1391.1940 1394.6415 1401.1068 1435.3580 1439.8081 1449.4944 1470.4131 1473.2380 1487.1551 1514.5070 1564.8361 1567.7726 1594.2580 1608.0334 1610.6272 1637.1927 3025.0335 3111.1631 3136.4872 3149.5686 3149.8250 3153.5868 3159.6305 3168.4878 3170.0813 3175.2762 3181.6269 3183.6955 3198.5701 3208.3177
redmass: 5.7282 3.8722 5.5647 5.2778 4.8007 5.5637 5.3531 3.7731 3.1542 4.7407 5.8099 2.7669 3.0090 3.0293 3.7985 7.0474 2.6342 4.0223 5.3409 6.2587 2.8445 6.3112 4.9474 4.5772 5.3272 1.7951 5.4322 1.6219 4.0632 1.8535 2.1742 3.4363 1.4099 1.2588 1.4222 4.3136 1.6067 1.8401 2.5568 1.4109 2.7746 5.1633 1.4569 2.7750 1.4713 1.3853 1.3739 2.2667 2.0937 1.6023 2.1058 1.8410 1.0689 1.3802 1.0805 1.1570 1.2253 2.3871 1.9333 1.8068 1.6250 1.6854 1.3403 1.5267 7.7977 3.8689 4.6571 2.3150 1.5481 1.9266 2.4344 1.7603 3.7176 6.0251 6.2353 6.8901 5.3792 6.1581 5.9545 1.0640 1.0999 1.0879 1.0888 1.0880 1.0905 1.0916 1.0959 1.0967 1.0912 1.1017 1.1006 1.0949 1.0994
irintensity: 0.5819 0.2772 1.3600 5.3995 0.9730 2.2132 7.3521 2.2741 1.7632 0.7196 14.2403 0.1253 0.8021 0.7189 2.8636 0.2741 24.2116 12.2115 14.9225 5.2879 9.6662 1.3397 0.9721 2.1700 29.8843 50.2604 0.1321 28.3820 3.6004 21.6631 29.7371 38.8066 53.9208 1.6772 22.7406 2.1410 5.1575 21.8834 40.8658 4.1752 1.4664 16.8394 3.3414 6.2542 0.7427 0.2196 0.0711 0.3451 0.5568 9.9744 9.4622 6.0084 5.4573 17.7870 6.8923 22.9406 19.9786 131.5515 36.9342 64.8477 70.2030 10.4366 19.5390 17.3812 5.5128 8.8674 43.9640 39.0240 2.1426 8.0091 35.5150 2.2207 19.0537 79.4065 96.5933 120.9365 13.5159 6.6439 64.8431 11.7490 1.0929 8.9089 0.2638 1.1519 0.0495 4.1802 4.2494 6.8927 1.2620 11.9058 4.4564 3.4333 0.0869
temp: 298.150 k
press: 1.00000 atm
elementType: 8 7 6 6 6 6 6 6 6 6 6 6 6 6 6 6 6 6 6 1 1 1 1 1 1 1 1 1 1 1 1 1 1
symmnumber: 1
zpe: 691348.4 jmol-1
zpe.correction: 0.263321 hartree
zpe.thermalcorrener: 0.278256 hartree
zpe.thermalcorrenthalpy: 0.279201 hartree
zpe.thermalcorrgfe: 0.219378 hartree
zpe.sumelectzpe: -784.665484 hartree
zpe.sumelectthermal: -784.650548 hartree
zpe.sumelectthermalent: -784.649604 hartree
zpe.sumelectthermalfe: -784.709426 hartree
dipole: -2.7882 2.9011 1.6360
dipole: 4.3437
quadrupole: -20.1211 -89.6913 -103.8087
quadrupole: 4.0952 4.1176 -3.6186
quadrupole: 51.0860 -18.4843 -32.6017 4.0952 4.1176 -3.6186
hfenergy: -784.9288043 hartree
pointgroup: C01 [X(C17H14N1O1)]
dipole: -1.1077134 0.862422 0.9744847 debye
polarizability: 346.2851714|17.324768|161.348194|24.8558701|18.0068705|115.0211119 unknown
InChI: InChI=1S/C17H14NO/c19-17(15-7-2-1-3-8-15)13-18-11-10-14-6-4-5-9-16(14)12-18/h1-12H,13H2
charge 1 multiplicity 1
33 atoms
O  0.889653 -0.978829 -0.820063
N  -0.645527 0.636139 0.745168
C  0.792937 0.540809 1.084349
C  -2.73851 -0.485382 0.258271
C  -3.326302 0.781129 -0.137987
C  -1.385633 -0.506238 0.682828
C  -1.185729 1.864973 0.352544
C  -2.498322 1.951226 -0.074529
C  1.563101 -0.281043 -0.009507
C  -3.521615 -1.684692 0.209407
C  -4.685025 0.810324 -0.570449
C  3.04043 -0.224538 -0.003862
C  -4.848486 -1.624563 -0.219989
C  -5.429922 -0.374505 -0.609759
C  3.779618 0.505315 0.972844
C  3.738733 -0.947051 -1.016497
C  5.187254 0.510564 0.934161
C  5.144224 -0.932774 -1.053529
C  5.870874 -0.204238 -0.079205
H  1.201412 1.557958 1.180596
H  0.912455 0.032458 2.058848
H  -0.897444 -1.432376 0.990337
H  -0.519994 2.727048 0.410105
H  -2.895494 2.927062 -0.366584
H  -3.072147 -2.639299 0.502827
H  -5.136722 1.761126 -0.871464
H  -5.453447 -2.535044 -0.263137
H  -6.472105 -0.351503 -0.943423
H  3.275794 1.061929 1.77123
H  3.158525 -1.505944 -1.757677
H  5.753842 1.067499 1.68674
H  5.676763 -1.484499 -1.834234
H  6.965407 -0.193943 -0.108559
