program: Gaussian 09
title: 000052606
version: EM64L-G09RevD.01
frameworkgroup: C1[X(C20H18N4O)]
method: RPBEPBE
basis: SDD
operation: Freq
keyword: #p
keyword: freq=noraman
keyword: PBEPBE/SDD
title: #p freq=noraman PBEPBE/SDD
converged: NO YES NO NO
title: Mulliken charges:
elementType: O N N N N C C C C C C C C C C C C C C C C C C C C H H H H H H H H H H H H H H H H H H
charge: -0.283493 -0.663016 -0.389227 -0.663434 -0.384654 0.307242 0.172807 -0.513869 -0.543485 0.414990 0.366983 -0.395407 -0.323158 -0.398354 0.067314 0.529417 -0.193802 0.345008 -0.347353 -0.430245 -0.410153 -0.195402 -0.339412 -0.382269 0.080760 0.268716 0.310482 0.251813 0.191483 0.239013 0.253294 0.227452 0.222484 0.230646 0.216531 0.187726 0.293618 0.314448 0.311689 0.213550 0.315038 0.311850 0.212382
chargesum: 0.00000
title: Mulliken charges with hydrogens summed into heavy atoms:
elementType: O N N N N C C C C C C C C C C C C C C C C C C C C
charge: -0.283493 -0.036879 -0.175677 -0.036546 -0.172272 0.307242 0.172807 -0.245153 -0.233003 0.414990 0.366983 -0.143595 -0.131675 -0.159342 0.067314 0.529417 0.059493 0.345008 -0.119901 -0.207761 -0.179508 0.021129 -0.151686 -0.088651 0.080760
polarizability: 8.90356733e+02 -3.61667082e+01 2.47348339e+02 4.45421649e-02 1.00774946e-01 9.79216708e+01
1716.lowfreq: -67.3900 -58.8636 -0.0016 -0.0007 0.0012 0.5826 1.4647 10.4563 16.3709
frequency: -67.3893 -58.8517 16.3048 22.8348 28.8653 42.3471 76.2431 93.7642 137.7273 138.6117 155.6390 187.9092 225.2347 233.4864 235.1957 282.9125 296.9911 325.9109 338.0544 348.7890 353.7419 364.3503 379.0757 402.4680 415.4797 441.7591 444.5126 448.8494 462.3274 484.0251 490.8629 506.1998 531.3559 548.8770 558.4460 583.1122 594.3362 636.5266 642.0313 649.0092 687.4290 717.6956 720.5034 730.2796 751.2531 753.5873 796.9076 806.8861 810.3546 815.8263 823.0981 827.4671 846.0409 847.9099 875.2030 887.0309 908.8277 924.5331 926.3597 934.2637 948.9797 957.9174 1001.8977 1005.3743 1014.0246 1030.9604 1037.2387 1072.2707 1072.9934 1091.9427 1116.0378 1121.9124 1136.4233 1145.6798 1185.1704 1188.8491 1200.6430 1211.6232 1246.5478 1260.6167 1274.1358 1281.8639 1291.7168 1303.6818 1321.1789 1326.2184 1363.2691 1372.8772 1389.0404 1399.4193 1422.1140 1448.2677 1470.6347 1504.6398 1535.8365 1554.4213 1578.4481 1593.9645 1597.1051 1604.9018 1623.4692 1632.7288 1635.9542 1638.9979 1641.4454 3084.4039 3094.2833 3113.1045 3115.6510 3124.2789 3124.9342 3135.4210 3147.3715 3168.3428 3169.6519 3174.5387 3223.0667 3327.6623 3329.8398 3547.5633 3547.9481 3690.0990 3690.1280
redmass: 3.3716 3.3163 6.5040 6.0529 4.0838 6.3655 6.1057 5.7432 3.8592 6.9130 3.0967 5.3537 3.5949 3.3685 3.6824 5.0326 3.8341 4.7255 1.5514 1.7559 1.7387 6.4629 3.0221 4.1324 2.1952 1.9834 1.2712 1.4608 4.9230 3.6620 4.4959 2.5674 4.0672 3.3913 3.2093 3.5848 4.6774 7.0838 3.5883 3.3543 2.7796 4.4534 5.4610 4.8554 3.2415 3.5592 1.6453 1.3954 1.3579 1.5154 1.4206 5.4108 1.5651 5.1701 1.6222 6.0534 2.0632 1.4031 3.9598 1.2037 1.4114 1.4680 1.1195 3.0858 1.3326 1.7848 1.6228 1.7085 1.5704 1.6473 1.5868 2.3168 1.9884 1.6828 1.9360 1.7593 1.2298 1.4530 1.8265 4.0452 1.6999 1.7151 2.0360 1.4860 1.4183 1.7720 4.1496 2.9311 3.9533 4.2644 3.9402 4.3732 4.1609 2.7365 5.4472 5.8658 4.8127 4.2453 4.7904 5.1014 5.9859 5.5651 4.0714 1.3790 1.4601 1.0919 1.0878 1.0928 1.0867 1.0891 1.0875 1.0879 1.0948 1.0928 1.0946 1.0959 1.0979 1.0762 1.0762 1.0452 1.0453 1.1031 1.1030
irintensity: 16.7726 18.8043 0.2745 1.2409 2.1242 0.1279 0.2165 0.4954 0.2245 1.7642 0.0273 13.2318 1.1771 1.7395 1.8880 20.7971 0.3109 1.4603 22.9418 3.5527 125.3891 3.5614 0.1238 2.6366 58.1389 91.1491 48.9299 200.6505 37.4400 1.1876 0.3692 27.6037 49.1510 0.7748 4.7853 66.4436 8.1450 1.5637 3.4855 1.4978 5.9072 8.0928 0.8541 15.3530 36.8616 0.1238 3.2105 26.2129 112.8238 48.7774 59.8412 20.3504 0.0838 5.5999 55.2027 30.5740 1.9664 0.1768 2.1709 1.5784 1.4937 30.0110 114.5386 11.0115 6.2995 5.6291 17.3381 286.9194 62.3923 105.2090 11.7611 8.1970 19.3492 25.1814 9.8296 21.3891 4.6768 3.0326 0.4804 13.2911 27.5574 3.6032 1.5184 2.7762 1.4435 3.8517 79.2897 121.4163 162.7751 122.5085 16.4540 1.8408 29.2162 20.2990 14.5586 54.8822 101.1928 142.6267 15.2109 31.6944 40.2132 1.8884 53.2707 185.0648 224.2073 1.3615 38.6133 12.0908 40.5032 4.4661 44.5004 28.0354 21.7209 7.6443 1.0793 9.0068 9.0200 30.7032 39.3034 21.9481 19.6777 34.7947 19.6255
temp: 298.150 k
press: 1.00000 atm
elementType: 8 7 7 7 7 6 6 6 6 6 6 6 6 6 6 6 6 6 6 6 6 6 6 6 6 1 1 1 1 1 1 1 1 1 1 1 1 1 1 1 1 1 1
symmnumber: 1
zpe: 880316.0 jmol-1
zpe.correction: 0.335295 hartree
zpe.thermalcorrener: 0.356156 hartree
zpe.thermalcorrenthalpy: 0.357100 hartree
zpe.thermalcorrgfe: 0.283932 hartree
zpe.sumelectzpe: -1065.395626 hartree
zpe.sumelectthermal: -1065.374765 hartree
zpe.sumelectthermalent: -1065.373820 hartree
zpe.sumelectthermalfe: -1065.446988 hartree
dipole: 0.5962 -1.0501 0.0702
dipole: 1.2096
quadrupole: -87.0197 -129.9483 -158.3979
quadrupole: 54.7063 1.2547 -0.0791
quadrupole: 38.1023 -4.8263 -33.2760 54.7063 1.2547 -0.0791
hfenergy: -1065.7309203 hartree
pointgroup: C01 [X(C20H18N4O1)]
dipole: 0.2376791 -0.4112498 0.0292609 debye
polarizability: 890.8626218|-31.3385732|246.8395607|-0.7138827|-0.5571903|97.9245601 unknown
InChI: InChI=1S/C20H18N4O/c21-19(22)14-7-5-13(6-8-14)3-1-2-4-17-12-16-11-15(20(23)24)9-10-18(16)25-17/h1-12,21,23H,22,24H2
charge 0 multiplicity 1
43 atoms
O  2.476646 0.619115 -0.00091
N  8.975104 1.00776 0.031282
N  8.524911 -1.359593 -0.010552
N  -9.09035 -1.376363 0.026425
N  -9.236741 1.032777 0.039463
C  4.376192 -0.725328 0.015871
C  3.883161 0.617424 -0.001771
C  3.20824 -1.580697 0.028325
C  5.77245 -0.941778 0.018078
C  2.080833 -0.759143 0.017698
C  6.644481 0.173606 0.003306
C  4.713764 1.742559 -0.018568
C  6.105724 1.499613 -0.015976
C  0.673434 -1.052045 0.022854
C  8.123777 -0.101476 0.008042
C  -4.180709 0.315927 0.009993
C  -0.332323 -0.104802 0.011718
C  -7.042974 0.005269 0.022514
C  -2.733238 0.536119 0.00566
C  -4.783183 -0.977903 0.014947
C  -5.054477 1.445839 0.010237
C  -1.740432 -0.422445 0.016129
C  -6.180944 -1.127597 0.021143
C  -6.449695 1.295722 0.016405
C  -8.540536 -0.090608 0.030627
H  3.194005 -2.669012 0.042764
H  6.220445 -1.939213 0.030703
H  4.306475 2.7568 -0.034371
H  6.762347 2.376292 -0.035095
H  0.418737 -2.119724 0.036555
H  -0.048041 0.956504 -0.001701
H  -2.416347 1.590053 -0.006151
H  -4.153294 -1.87403 0.012723
H  -4.61984 2.453156 0.005315
H  -2.00825 -1.489207 0.030078
H  -6.581352 -2.148912 0.02544
H  -7.123679 2.157302 0.017183
H  9.982834 0.867652 0.031376
H  8.632741 1.963666 0.060261
H  9.560193 -1.46471 -0.003262
H  -10.100956 -1.493688 0.031984
H  -8.518018 -2.215673 0.01418
H  -10.266614 0.881795 0.043078
