program: Gaussian 09
title: 000052589
version: EM64L-G09RevD.01
frameworkgroup: C1[X(C17H11ClO2S)]
method: RPBEPBE
basis: SDD
operation: Freq
keyword: #p
keyword: freq=noraman
keyword: PBEPBE/SDD
title: #p freq=noraman PBEPBE/SDD
converged: YES YES NO NO
title: Mulliken charges:
elementType: Cl S O O C C C C C C C C C C C C C C C C C H H H H H H H H H H H
charge: 0.044210 0.271760 -0.206439 -0.178453 0.275583 0.285902 -0.329172 0.109103 0.081276 -0.289341 -0.782678 -0.364956 -0.360027 0.475939 -0.224712 -0.221042 -0.360247 -0.381475 -0.220035 -0.219141 -0.231466 0.284572 0.302993 0.288896 0.291791 0.242963 0.243438 0.238947 0.238515 0.230331 0.230502 0.232463
chargesum: 0.00000
title: Mulliken charges with hydrogens summed into heavy atoms:
elementType: Cl S O O C C C C C C C C C C C C C C C C C
charge: 0.044210 0.271760 -0.206439 -0.178453 0.275583 0.285902 -0.329172 0.109103 0.081276 -0.289341 -0.195113 -0.076060 -0.068236 0.475939 0.018251 0.022395 -0.121300 -0.142960 0.010297 0.011361 0.000997
polarizability: 3.95060654e+02 -4.14836615e-01 2.17647510e+02 -1.30061696e+01 8.29190427e+00 1.24166573e+02
1716.lowfreq: -5.7118 -0.0017 -0.0010 -0.0009 3.6878 5.1702 8.3791 21.1817 41.0765
frequency: 4.9157 21.1274 41.0727 51.6766 59.0525 76.8259 116.1154 126.3508 161.1016 164.4435 219.0738 242.5180 265.5016 284.1221 330.7716 334.9375 347.0688 373.9594 401.5431 419.3154 423.8250 465.1646 475.1040 519.3524 531.5589 548.8234 615.8765 619.4980 631.2205 685.1488 687.4633 701.2537 716.5344 773.0231 787.4270 803.8885 809.8148 823.8248 843.3082 850.3614 852.5453 879.9801 928.3422 930.9012 978.5423 989.8752 996.5799 998.9222 1014.2206 1024.8252 1026.1938 1068.5395 1078.5212 1090.8789 1113.1354 1127.1301 1173.2396 1174.2390 1188.1502 1211.7365 1224.9228 1237.4352 1270.1735 1283.8978 1324.7606 1385.3857 1402.4136 1433.9374 1438.9255 1440.0616 1470.7470 1483.1808 1501.6899 1532.5739 1544.7569 1592.9521 1597.4937 1605.6325 1612.4738 3073.6995 3124.2643 3125.9780 3138.4634 3139.8204 3150.8435 3154.2916 3160.1821 3164.8976 3166.9355 3174.4163
redmass: 6.6663 4.3277 7.2936 3.9373 10.5327 11.3897 5.7501 5.6614 8.4366 8.6929 8.5050 6.4852 7.4086 9.2862 5.4374 3.1844 10.6509 11.3965 2.7923 5.3809 3.8176 6.7657 5.6732 5.9215 8.3646 6.4457 6.0946 5.0744 6.9913 4.8187 7.9652 1.6729 2.9413 2.0938 8.0202 1.6774 4.2744 9.8390 3.6706 6.5036 1.2682 1.5050 1.4490 1.6548 1.3934 6.1889 1.3937 1.3254 1.3622 2.7640 2.1995 1.4109 3.5899 3.2361 1.1339 2.5915 1.0732 1.0530 1.1124 1.2252 2.8251 2.1383 4.8759 2.2124 1.2832 8.8873 10.1814 1.1314 2.4246 2.1686 2.7756 2.3266 9.5352 10.9432 10.7073 6.0723 8.0527 6.6468 6.0975 1.0593 1.0855 1.0884 1.0919 1.0864 1.0964 1.0903 1.1077 1.0947 1.1017 1.1004
irintensity: 0.3884 0.3066 0.8775 1.2367 2.9334 0.1679 0.4978 0.0612 1.1478 1.0377 1.5081 4.0033 1.1867 1.3285 1.3276 1.2352 2.2415 19.5088 0.0289 0.4628 1.1482 0.5878 7.3633 0.3395 2.0563 29.8673 4.2850 38.6765 25.6760 0.9686 0.3234 59.4504 62.5885 40.1785 80.5282 38.4764 17.4383 27.4240 0.7005 21.2036 0.4566 0.8972 2.5751 0.3690 0.0188 1.7504 3.4333 0.0916 0.0983 7.1039 6.8336 6.8359 12.6696 1.1707 6.2841 193.7052 8.7403 0.0276 5.8881 21.7857 48.8444 58.9208 373.3738 38.5333 0.3745 0.3511 0.6426 5.6541 2.5279 9.0069 29.6663 11.3611 285.5506 20.5122 343.4192 0.9574 6.8868 1.9845 0.1011 6.8160 6.3735 1.1849 13.0834 4.0505 33.9141 5.2535 3.8505 0.9836 28.5552 27.8569
temp: 298.150 k
press: 1.00000 atm
elementType: 17 16 8 8 6 6 6 6 6 6 6 6 6 6 6 6 6 6 6 6 6 1 1 1 1 1 1 1 1 1 1 1
symmnumber: 1
zpe: 599075.9 jmol-1
zpe.correction: 0.228176 hartree
zpe.thermalcorrener: 0.246362 hartree
zpe.thermalcorrenthalpy: 0.247306 hartree
zpe.thermalcorrgfe: 0.177374 hartree
zpe.sumelectzpe: -1661.526448 hartree
zpe.sumelectthermal: -1661.508262 hartree
zpe.sumelectthermalent: -1661.507318 hartree
zpe.sumelectthermalfe: -1661.577249 hartree
dipole: 0.6588 -4.1097 0.6603
dipole: 4.2142
quadrupole: -105.5282 -144.1750 -130.7116
quadrupole: 16.4988 -1.1421 0.5285
quadrupole: 21.2767 -17.3700 -3.9067 16.4988 -1.1421 0.5285
hfenergy: -1661.7546236 hartree
pointgroup: C01 [X(C17H11Cl1O2S1)]
dipole: -0.1855579 1.3443221 0.9525569 debye
polarizability: 394.065704|-15.6363013|206.8992796|11.7392598|31.6679098|135.9097537 unknown
InChI: InChI=1S/C17H11ClO2S/c18-14-15(19)12-8-4-5-9-13(12)16(20)17(14)21-10-11-6-2-1-3-7-11/h1-9H,10H2
charge 0 multiplicity 1
32 atoms
Cl 0.481075 -3.009456 -1.679617
S  -1.307667 -0.570349 -0.757192
O  0.505334 1.743182 0.411081
O  3.395527 -2.670231 -1.146667
C  2.641699 0.641581 0.308548
C  3.396954 -0.488047 -0.104857
C  0.483597 -0.502086 -0.48961
C  1.162855 0.700426 0.103237
C  2.731468 -1.659682 -0.757807
C  1.259138 -1.574576 -0.905591
C  -2.141983 0.842769 0.284689
C  3.294247 1.74065 0.918837
C  4.796863 -0.512543 0.093525
C  -3.62377 0.568112 0.255312
C  4.690054 1.711143 1.1182
C  5.442056 0.583244 0.705323
C  -4.216138 -0.318866 1.192593
C  -4.450119 1.197719 -0.711687
C  -5.606274 -0.563328 1.170127
C  -5.841274 0.953799 -0.736311
C  -6.422569 0.072972 0.205232
H  -1.707635 0.786856 1.292806
H  -1.859952 1.794952 -0.180419
H  2.691357 2.60126 1.224508
H  5.352543 -1.395069 -0.238381
H  5.192922 2.560893 1.59138
H  6.525938 0.562223 0.859916
H  -3.584251 -0.816421 1.938112
H  -4.000614 1.881724 -1.441574
H  -6.0527 -1.246852 1.900683
H  -6.46923 1.448936 -1.485084
H  -7.501649 -0.116235 0.187585
