program: Gaussian 09
title: 000052579
version: EM64L-G09RevD.01
frameworkgroup: C1[X(C16H32N2)]
method: RPBEPBE
basis: SDD
operation: Freq
keyword: #p
keyword: freq=noraman
keyword: PBEPBE/SDD
title: #p freq=noraman PBEPBE/SDD
converged: YES YES NO NO
title: Mulliken charges:
elementType: N N C C C C C C C C C C C C C C C C H H H H H H H H H H H H H H H H H H H H H H H H H H H H H H H H
charge: -0.089837 -0.117087 -0.127498 -0.078887 -0.444660 -0.452022 -0.410876 -0.479207 -0.486574 -0.599771 -0.349031 -0.183915 -0.183290 -0.310548 -0.302827 -0.578308 -0.682820 -0.695230 0.287558 0.274738 0.249662 0.284642 0.296368 0.271694 0.293413 0.290994 0.216767 0.250762 0.229631 0.248751 0.280797 0.256349 0.296493 0.280513 0.288228 0.247575 0.248484 0.282990 0.253768 0.280799 0.269381 0.277725 0.260334 0.293571 0.295566 0.210448 0.267274 0.297084 0.229571 0.260458
chargesum: 2.00000
title: Mulliken charges with hydrogens summed into heavy atoms:
elementType: N N C C C C C C C C C C C C C C C C
charge: -0.089837 -0.117087 0.160060 0.195850 0.089644 0.116041 0.173530 -0.011678 -0.008192 0.233868 0.219710 0.063661 0.065194 0.226210 0.247353 0.253322 0.090467 0.091883
polarizability: 2.07750853e+02 -6.97571453e+00 1.58250878e+02 6.52784006e+00 8.06152159e+00 1.57553765e+02
1716.lowfreq: -8.4401 -0.8730 -0.0003 0.0006 0.0008 8.6043 21.6867 32.0838 52.1948
frequency: 19.4936 31.9400 51.9564 74.9180 77.3350 118.2362 126.2868 140.6545 148.2994 192.2298 202.5349 229.6839 246.9703 253.7656 272.7755 288.8751 302.9693 309.1280 317.0768 332.7009 356.0789 369.4657 388.5790 431.1324 441.1241 442.5794 475.7717 492.1517 504.0927 506.8993 518.0789 602.3119 681.5081 685.5535 726.4366 765.2697 772.8259 780.7014 781.2591 800.1974 811.5630 826.8478 882.4252 892.4491 900.3266 907.4303 925.3557 935.6681 950.8640 981.8247 982.4391 989.9682 1008.2296 1013.7958 1050.7456 1053.5103 1066.0199 1069.7100 1081.8644 1086.5363 1094.9420 1109.3819 1114.9643 1125.3264 1136.8021 1147.0802 1157.9526 1164.5641 1177.9616 1191.9858 1198.6845 1212.2455 1242.1608 1257.1988 1276.1628 1283.2429 1286.0744 1292.0007 1304.5706 1310.6583 1316.0538 1324.2806 1336.5959 1342.7637 1345.4989 1349.6487 1354.0293 1363.8682 1367.3665 1368.8166 1401.0639 1419.1350 1421.5747 1434.6536 1437.2317 1456.1353 1459.9025 1464.8104 1465.5600 1468.2785 1470.7825 1471.8215 1474.2861 1475.7018 1476.7888 1479.1294 1485.5503 1489.6032 1490.8646 1494.0298 1496.5238 1672.4134 2957.9673 2963.5859 2973.4527 2989.9837 3002.5744 3004.6068 3017.7082 3023.6213 3025.7783 3029.7050 3033.3920 3034.0795 3036.0232 3036.8220 3037.7352 3050.3805 3083.3507 3089.8804 3092.9924 3094.3036 3100.4944 3105.5351 3114.4558 3117.1601 3121.7372 3123.8621 3137.0533 3140.5393 3143.2171 3143.6455 3152.8719 3162.5988
redmass: 3.3075 3.6113 3.0825 2.0818 2.8438 2.0232 2.1951 2.4658 2.0276 2.3936 2.5915 1.3246 1.7639 1.2367 1.3478 1.5257 2.1259 1.8766 2.1915 2.2203 2.4175 2.5999 2.1655 2.3746 2.8287 2.5756 2.8317 3.3058 4.0870 2.6896 2.6749 3.4569 1.2557 2.7334 3.8259 2.6631 1.9202 3.2895 1.3349 1.2670 2.6107 1.6139 2.6735 1.7480 2.4319 2.4877 2.3896 1.9286 1.9771 2.1243 1.2249 1.8902 2.1971 1.9632 2.3338 1.8196 1.9477 2.0131 2.6241 2.1585 2.1161 1.8990 1.9208 1.8667 1.5272 1.4772 1.2528 1.7248 1.2926 1.8583 1.7932 1.1404 1.5344 1.3587 1.2506 1.2579 1.1307 1.2677 1.2410 1.2633 1.2631 1.2353 1.3327 1.4023 1.3545 1.3787 1.4195 1.2992 1.2961 1.4331 1.2921 1.1763 1.2000 1.1483 1.1526 1.0725 1.0671 1.0924 1.0855 1.0609 1.0691 1.0557 1.0644 1.0534 1.0800 1.0767 1.0506 1.0463 1.0604 1.0655 1.0728 6.3590 1.0680 1.0697 1.0789 1.0828 1.0393 1.0387 1.0605 1.0387 1.0532 1.0437 1.0510 1.0944 1.0957 1.0610 1.0596 1.0582 1.1015 1.0973 1.1035 1.1041 1.1037 1.1076 1.1096 1.1023 1.1064 1.1043 1.0861 1.1057 1.1044 1.1045 1.1056 1.0998
irintensity: 0.4582 0.8570 0.2858 0.6640 0.2151 0.3781 0.0300 0.1517 0.1940 0.4052 0.0428 0.1067 0.1688 0.0726 0.2640 0.0431 0.6032 0.1604 1.7497 0.1256 0.0310 0.2547 0.0832 0.1346 1.0339 0.7948 1.4354 0.6513 0.5279 0.1425 1.2522 1.5837 52.6875 6.7586 7.4823 4.0633 33.1558 11.9974 17.6572 13.0091 21.5205 4.5019 17.7260 15.9574 6.4639 16.0392 20.3854 4.3234 7.7857 4.8710 0.5156 5.9758 31.0859 19.8070 0.7578 1.1258 2.4342 0.1099 6.3060 5.3888 3.4307 3.1822 2.2476 1.4097 4.9289 2.2353 14.9599 5.1104 1.2589 0.8315 0.5646 0.2472 4.0652 0.3430 2.7023 2.2258 4.3516 5.2012 1.7438 1.5614 1.3235 2.0433 3.0314 0.5700 2.1974 5.6221 0.4607 7.8527 0.0888 0.5599 5.0377 40.5156 18.4842 37.3914 16.8523 1.1913 5.3091 3.3452 1.8231 21.3813 34.5253 19.6421 23.7870 5.9054 41.7207 20.3187 8.3884 27.8726 1.9463 7.5366 62.6876 5.6580 20.2418 14.5519 4.2160 16.4299 10.4156 5.5961 21.8419 3.6052 3.2749 1.0228 7.5114 3.4058 22.8440 4.7497 9.0000 1.8842 5.0214 6.3668 2.4067 3.8012 0.5469 5.8546 6.3897 23.3410 3.4586 11.4968 0.0861 2.8793 8.7227 0.2238 2.4235 11.0259
temp: 298.150 k
press: 1.00000 atm
elementType: 7 7 6 6 6 6 6 6 6 6 6 6 6 6 6 6 6 6 1 1 1 1 1 1 1 1 1 1 1 1 1 1 1 1 1 1 1 1 1 1 1 1 1 1 1 1 1 1 1 1
symmnumber: 1
zpe: 1212877.3 jmol-1
zpe.correction: 0.461961 hartree
zpe.thermalcorrener: 0.482070 hartree
zpe.thermalcorrenthalpy: 0.483015 hartree
zpe.thermalcorrgfe: 0.413564 hartree
zpe.sumelectzpe: -736.320380 hartree
zpe.sumelectthermal: -736.300270 hartree
zpe.sumelectthermalent: -736.299326 hartree
zpe.sumelectthermalfe: -736.368776 hartree
dipole: 9.7353 -2.1182 -0.9730
dipole: 10.0104
quadrupole: -11.7823 -84.5242 -90.6459
quadrupole: 5.5678 -1.4538 0.0487
quadrupole: 50.5352 -22.2068 -28.3284 5.5678 -1.4538 0.0487
hfenergy: -736.7823404 hartree
pointgroup: C01 [X(C16H32N2)]
dipole: 3.8391684 -0.7937648 -0.3765472 debye
polarizability: 208.0403549|-5.9006072|158.7813011|6.2989146|8.1453848|156.7338398 unknown
InChI: InChI=1S/C16H32N2/c1-5-17(3,6-2)11-12-18(4)13-15-9-7-8-10-16(15)14-18/h7-8,15-16H,5-6,9-14H2,1-4H3
charge 2 multiplicity 1
50 atoms
N  -0.399586 -1.07235 0.052595
N  3.322862 0.217023 -0.368901
C  -2.492993 -0.065612 0.858509
C  -2.608079 -0.188515 -0.683873
C  -0.975224 -0.020529 1.070572
C  -1.554602 -1.247295 -1.034247
C  0.873203 -0.574552 -0.651991
C  -3.297038 1.145236 1.37666
C  -4.060218 -0.504592 -1.10346
C  -0.167335 -2.41164 0.75193
C  2.025304 -0.239245 0.32508
C  -4.677441 1.157981 0.728498
C  -5.018844 0.416548 -0.357792
C  3.107684 1.481475 -1.264737
C  4.376449 0.572657 0.742084
C  3.890702 -0.889721 -1.263151
C  2.534218 2.712034 -0.556293
C  4.869538 -0.603195 1.590974
H  -2.913507 -0.981168 1.323301
H  -2.32708 0.788123 -1.130364
H  -0.58024 0.970892 0.78292
H  -0.628678 -0.284452 2.0826
H  -1.947176 -2.270465 -0.912958
H  -1.103401 -1.149199 -2.034633
H  0.566779 0.314125 -1.228838
H  1.167338 -1.370399 -1.357424
H  -2.767149 2.096739 1.156534
H  -3.405658 1.099476 2.476654
H  -4.311225 -1.565266 -0.890393
H  -4.190171 -0.37118 -2.19396
H  0.146341 -3.162606 0.009661
H  0.592942 -2.310177 1.541021
H  -1.112803 -2.731078 1.214889
H  2.305627 -1.118945 0.924869
H  1.73769 0.572314 1.012269
H  -5.426456 1.808039 1.195067
H  -6.042297 0.469961 -0.746429
H  4.10294 1.703136 -1.687486
H  2.461721 1.163782 -2.101447
H  5.215605 1.038938 0.197273
H  3.903207 1.341516 1.373949
H  3.906637 -1.844324 -0.717988
H  3.282714 -0.981815 -2.175665
H  4.917708 -0.616833 -1.549601
H  2.429679 3.509521 -1.313519
H  1.527948 2.550016 -0.130133
H  3.195146 3.114255 0.227792
H  5.607523 -0.197163 2.306205
H  4.081283 -1.075803 2.201413
H  5.396213 -1.375968 1.008365
