program: Gaussian 09
title: 000052539
version: EM64L-G09RevD.01
frameworkgroup: C1[X(C13H28N2)]
method: RPBEPBE
basis: SDD
operation: Freq
keyword: #pfreq=noraman
keyword: PBEPBE/SDD
title: #p freq=noraman PBEPBE/SDD
converged: YES YES NO NO
title: Mulliken charges:
elementType: N N C C C C C C C C C C C C C H H H H H H H H H H H H H H H H H H H H H H H H H H H H
charge: -0.053381 -0.043314 -0.365907 -0.351587 -0.348606 -0.400377 -0.373294 -0.357857 -0.399417 -0.356538 -0.442292 -0.351418 -0.441216 -0.695057 -0.696118 0.183857 0.183984 0.186142 0.214969 0.188056 0.192865 0.203240 0.203019 0.204159 0.192587 0.215856 0.183825 0.216736 0.199102 0.195075 0.193050 0.223794 0.208254 0.191870 0.194168 0.218076 0.218214 0.209858 0.209824 0.214726 0.208572 0.209626 0.212878
chargesum: 0.00000
title: Mulliken charges with hydrogens summed into heavy atoms:
elementType: N N C C C C C C C C C C C C C
charge: -0.053381 -0.043314 0.001934 0.049523 0.032315 0.005882 0.023452 0.041824 0.016421 0.031586 -0.010244 0.034619 -0.004926 -0.060650 -0.065043
polarizability: 1.87017717e+02 -4.60163576e+00 1.58559934e+02 -1.56613409e+00 -9.61433860e-01 1.26561720e+02
1716.lowfreq: -9.8760 -6.0410 -0.0002 0.0003 0.0007 12.0269 19.5498 27.5550 40.4451
frequency: 18.7473 27.1451 40.0349 43.7120 65.6780 81.4272 88.2499 99.4603 108.6769 125.0707 134.5880 143.4250 153.7799 210.6649 231.5546 239.8188 244.2916 250.9065 264.0395 326.2183 387.1172 389.9134 409.4451 428.0850 487.5738 526.2897 567.7874 721.6157 724.9907 735.0726 754.7729 775.7367 823.1243 835.9217 853.3566 878.2581 890.5111 896.4107 913.5839 926.9256 972.4458 986.9687 993.7965 998.9281 1037.4315 1049.2876 1059.4455 1069.0790 1077.0821 1083.6567 1096.6333 1107.3179 1121.8357 1128.9524 1137.7003 1190.0099 1196.7436 1205.5520 1214.9244 1235.6244 1247.9129 1255.2478 1269.0144 1277.7789 1283.7395 1286.8672 1290.6056 1295.5932 1300.3775 1315.1818 1320.2329 1334.6314 1340.7618 1344.7794 1353.5485 1358.0067 1364.2913 1392.7892 1393.0930 1448.1236 1452.3687 1457.6352 1459.3993 1461.1794 1464.5682 1466.6409 1468.1191 1474.3796 1476.9922 1478.8699 1480.1761 1481.7335 1483.7365 1487.6004 1489.3879 2947.3398 2954.8184 2955.2028 2961.5389 2962.9304 2965.9594 2967.9937 2970.2085 2970.8943 2971.6516 2974.4522 2975.7537 2983.4213 2985.0608 2996.9236 3002.0508 3013.3629 3016.3158 3028.7796 3033.7299 3042.3859 3043.5912 3051.5768 3052.8763 3066.1910 3067.5878 3068.8035 3070.5855
redmass: 3.6706 3.1233 3.2133 1.7298 3.2565 1.6472 3.5211 2.9805 1.7001 3.1004 2.5052 3.0984 2.1476 2.3804 1.4136 1.1049 2.4865 2.0830 3.5642 2.3599 2.9761 3.1295 2.6087 2.7924 3.1348 2.6421 2.4315 1.0741 1.1197 1.1267 1.2377 1.3051 1.4299 1.5218 2.4895 2.2355 1.6423 1.6454 2.0060 1.4980 1.5655 1.7081 1.7735 3.3971 2.1814 2.6640 2.2500 2.4987 2.5002 1.9884 1.9464 1.5753 2.2988 1.8897 2.5194 1.6292 1.3023 1.4407 1.3828 1.3294 1.2785 1.2659 1.2791 1.1466 1.1190 1.1693 1.1646 1.1505 1.1011 1.3023 1.3406 1.3998 1.3852 1.4104 1.6542 1.5419 1.5340 1.2191 1.2197 1.1544 1.1022 1.0883 1.0793 1.0778 1.0885 1.1556 1.0786 1.0720 1.0641 1.0734 1.1198 2.1508 1.1950 1.0873 1.0920 1.0587 1.0587 1.0597 1.0599 1.0583 1.0603 1.0605 1.0366 1.0594 1.0368 1.0615 1.0581 1.0633 1.0947 1.0958 1.0989 1.0998 1.0988 1.1039 1.1019 1.1037 1.1027 1.1033 1.1041 1.1004 1.1003 1.0999 1.0992
irintensity: 0.0096 0.0090 0.0021 0.0075 0.1676 0.0089 0.0116 0.2235 0.0541 0.3264 0.4416 0.2255 0.6620 0.9686 0.8755 0.0050 0.9660 0.5209 0.6700 6.8552 1.4213 2.6674 4.7750 1.1238 0.6628 1.4323 3.6147 24.8484 6.5647 0.4917 0.2702 4.0413 2.9999 1.3327 1.6396 4.1552 3.0834 0.2828 5.3927 0.7895 2.9773 0.4283 0.8290 1.3856 0.6638 1.1949 7.5816 2.8739 0.9322 1.8291 3.6168 2.0461 2.0659 2.3350 4.9556 0.1517 1.3172 0.7030 4.0486 1.1891 3.9788 1.3076 1.3914 0.7065 0.0958 1.8933 1.0218 0.6631 0.8703 1.0936 2.3992 1.5123 1.5404 0.7076 0.8384 4.2138 3.4785 22.5195 0.5473 8.3683 12.6395 2.8928 3.6226 3.2338 1.4598 4.2603 0.4339 1.3287 6.2433 5.1425 15.2031 6.3141 2.2706 0.8002 45.4505 6.6866 9.0122 1.1423 13.3397 14.7385 32.3499 52.5317 40.0680 48.7066 35.2627 129.7388 36.5120 38.0660 5.7766 12.9326 5.6159 2.1516 11.9321 24.3223 47.5546 60.8147 63.4837 104.4121 54.6633 121.8933 96.0062 27.6163 57.0946
temp: 298.150 k
press: 1.00000 atm
elementType: 7 7 6 6 6 6 6 6 6 6 6 6 6 6 6 1 1 1 1 1 1 1 1 1 1 1 1 1 1 1 1 1 1 1 1 1 1 1 1 1 1 1 1
symmnumber: 1
zpe: 1025467.3 jmol-1
zpe.correction: 0.390580 hartree
zpe.thermalcorrener: 0.410347 hartree
zpe.thermalcorrenthalpy: 0.411291 hartree
zpe.thermalcorrgfe: 0.339709 hartree
zpe.sumelectzpe: -620.375247 hartree
zpe.sumelectthermal: -620.355480 hartree
zpe.sumelectthermalent: -620.354536 hartree
zpe.sumelectthermalfe: -620.426118 hartree
dipole: 0.2057 0.2176 0.2559
dipole: 0.3939
quadrupole: -96.9717 -93.4260 -98.6524
quadrupole: -5.6945 1.5399 0.4969
quadrupole: -0.6217 2.9241 -2.3024 -5.6945 1.5399 0.4969
hfenergy: -620.7658265 hartree
pointgroup: C01 [X(C13H28N2)]
dipole: 0.0854215 0.0805121 0.1011853 debye
polarizability: 186.6596172|-5.23552|158.8273804|-3.1769865|0.1889984|126.6523724 unknown
InChI: InChI=1S/C13H28N2/c1-3-5-7-9-11-13-15-14-12-10-8-6-4-2/h3-13H2,1-2H3
charge 0 multiplicity 1
43 atoms
N  -2.048173 -1.422149 -0.725036
N  -3.15218 -1.131396 -0.122487
C  2.238689 -1.277799 0.435605
C  0.952817 -1.622051 -0.348213
C  3.291203 -0.530839 -0.413809
C  -0.100764 -2.336581 0.527229
C  -2.302039 1.566457 1.039371
C  -1.371927 2.1469 -0.05064
C  -3.722333 1.193514 0.548632
C  4.577128 -0.183673 0.370655
C  -1.421265 -2.67653 -0.206574
C  0.006746 2.572844 0.504549
C  -3.747872 0.151613 -0.599897
C  5.616908 0.574937 -0.48204
C  0.945244 3.138625 -0.583348
H  1.973668 -0.653954 1.315898
H  2.686918 -2.20992 0.840588
H  1.209045 -2.267322 -1.21459
H  0.512727 -0.698436 -0.770813
H  3.557106 -1.147294 -1.29824
H  2.84331 0.404605 -0.810666
H  0.323641 -3.284925 0.915213
H  -0.338398 -1.710595 1.411373
H  -1.823338 0.671038 1.484829
H  -2.401367 2.305718 1.860473
H  -1.217156 1.394326 -0.849664
H  -1.861456 3.02167 -0.529047
H  -4.310614 0.796976 1.398961
H  -4.245652 2.101348 0.18689
H  4.308321 0.426831 1.257092
H  5.028489 -1.118132 0.762757
H  -2.117786 -3.21284 0.469112
H  -1.196474 -3.305565 -1.090066
H  -0.135242 3.329224 1.303722
H  0.487152 1.696599 0.987864
H  -4.801117 -0.067697 -0.85892
H  -3.218401 0.525938 -1.498087
H  5.197668 1.525425 -0.863436
H  5.928158 -0.027536 -1.35646
H  6.524126 0.815934 0.102315
H  1.126351 2.388836 -1.377094
H  0.502623 4.032129 -1.062999
H  1.925517 3.430548 -0.1629
