program: Gaussian 09
title: 000002233
version: EM64L-G09RevD.01
frameworkgroup: C1[X(C6H16N5O)]
method: RPBEPBE
basis: SDD
operation: Freq
keyword: #p
keyword: freq=noraman
keyword: PBEPBE/SDD
title: #p freq=noraman PBEPBE/SDD
converged: YES YES NO NO
title: Mulliken charges:
elementType: O N N N N N C C C C C C H H H H H H H H H H H H H H H H
charge: -0.371804 -0.349048 -0.641446 -0.569089 -0.642942 -0.623363 -0.445740 -0.438098 -0.210068 -0.412917 0.283905 0.460788 0.246649 0.230971 0.245742 0.233403 0.271079 0.245837 0.250956 0.406192 0.301653 0.314230 0.349035 0.393618 0.383875 0.351560 0.378597 0.356427
chargesum: 1.00000
title: Mulliken charges with hydrogens summed into heavy atoms:
elementType: O N N N N N C C C C C C
charge: -0.371804 0.057144 -0.025563 0.173564 0.092493 0.111661 0.031879 0.041046 0.061011 0.083876 0.283905 0.460788
polarizability: 1.34593664e+02 -3.06039244e-01 1.08616076e+02 4.56451246e-01 1.09515957e+00 6.60362336e+01
1716.lowfreq: -20.7480 -1.1601 -0.0010 -0.0007 -0.0005 8.1707 29.8806 47.5705 65.0223
frequency: 29.7572 47.2117 65.0060 94.6794 114.9905 155.9676 193.0560 209.5202 266.0193 287.7147 297.7242 324.0398 351.5651 394.0889 428.6161 489.9186 494.8339 501.7075 540.4769 549.9914 573.1048 622.7472 643.6102 690.6830 702.5748 712.5669 733.0186 829.2409 860.7252 886.8105 921.0668 986.7468 1015.9085 1044.5997 1047.5846 1061.0231 1071.6736 1083.2341 1090.7688 1118.7223 1151.6620 1185.2487 1199.5794 1223.9496 1273.0208 1301.6522 1322.9440 1344.2424 1354.0178 1364.4873 1391.5487 1466.9359 1476.0996 1479.3394 1508.4178 1514.6962 1618.7838 1631.9058 1647.8800 1651.8776 1689.3773 1719.9257 2712.7503 2957.0345 2988.7545 2997.2327 3000.1348 3016.2423 3054.5890 3072.8156 3376.1515 3460.8790 3523.8160 3561.4682 3587.6232 3620.4590 3675.9860 3691.7651
redmass: 4.0812 3.1716 3.6969 3.4792 4.0875 2.8043 3.5508 2.3352 2.2306 2.0999 1.5349 1.9671 1.7360 3.2567 2.5186 2.7105 1.5105 1.7694 3.9369 1.2073 3.0713 1.1302 1.6725 8.3477 1.9545 1.4144 1.9233 2.0851 1.0912 2.3332 2.3466 2.6474 2.6049 1.2749 1.2422 1.8229 2.0268 2.2620 1.9894 3.0232 1.5576 1.7666 1.3289 1.3136 1.2194 1.2011 1.2968 1.3546 1.3196 1.3257 2.3370 1.0752 1.0963 1.0968 1.9621 1.5030 4.2844 1.4083 1.4595 1.1213 2.3434 1.4901 1.1048 1.0576 1.0746 1.0757 1.0745 1.0893 1.1021 1.0993 1.0542 1.0468 1.0498 1.0479 1.0975 1.0952 1.1030 1.1044
irintensity: 4.5802 3.3198 4.0058 4.6913 0.6542 1.6672 4.0116 11.3287 24.7208 21.4300 12.3109 11.5207 21.5181 2.9109 1.8599 5.1592 2.3570 2.6313 2.2850 262.3948 4.5982 204.2750 137.5285 33.3378 168.0495 137.9284 81.6326 16.6262 127.0318 7.8371 26.5909 14.5859 10.2863 60.3670 72.1062 8.6109 3.4801 1.8736 35.3441 23.4068 1.0024 9.7275 2.5727 4.8949 4.5165 2.1941 2.8856 3.7334 17.5451 0.4461 15.4520 2.0647 10.4346 14.4574 66.1520 155.7560 763.1467 54.9645 250.8090 44.9773 462.7873 172.7767 2091.0732 21.4071 0.4394 4.6795 15.6186 44.4737 13.1552 28.0149 129.7374 6.6974 147.0199 86.7114 14.2125 95.2974 102.1143 72.6342
temp: 298.150 k
press: 1.00000 atm
elementType: 8 7 7 7 7 7 6 6 6 6 6 6 1 1 1 1 1 1 1 1 1 1 1 1 1 1 1 1
symmnumber: 1
zpe: 642087.1 jmol-1
zpe.correction: 0.244558 hartree
zpe.thermalcorrener: 0.258438 hartree
zpe.thermalcorrenthalpy: 0.259382 hartree
zpe.thermalcorrgfe: 0.203529 hartree
zpe.sumelectzpe: -586.091083 hartree
zpe.sumelectthermal: -586.077204 hartree
zpe.sumelectthermalent: -586.076259 hartree
zpe.sumelectthermalfe: -586.132112 hartree
dipole: 3.6251 -0.0501 1.1891
dipole: 3.8155
quadrupole: -8.5450 -48.5306 -71.7174
quadrupole: 3.5362 1.4341 1.0232
quadrupole: 34.3860 -5.5996 -28.7864 3.5362 1.4341 1.0232
hfenergy: -586.3356414 hartree
pointgroup: C01 [X(C6H16N5O1)]
dipole: 1.4702221 0.1575084 0.2588541 debye
polarizability: 133.7038645|-1.524777|104.1724426|-7.5280198|-12.9701726|71.3696665 unknown
InChI: InChI=1S/C6H16N5O/c7-4(5(8)12)2-1-3-11-6(9)10/h4,11H,1-3,7-10H2
charge 1 multiplicity 1
28 atoms
O  -0.444376 1.129874 -0.736374
N  1.735489 -0.228055 -0.271036
N  -3.285825 -0.374401 1.022854
N  -2.656745 1.744101 -0.400643
N  2.774963 1.743613 -0.934108
N  4.097149 -0.072366 -0.193814
C  -0.854884 -1.225391 1.01222
C  0.137874 -2.044991 0.120252
C  -2.033909 -0.528416 0.249523
C  1.618349 -1.611123 0.225816
C  -1.637074 0.859984 -0.333306
C  2.868105 0.463971 -0.459084
H  -1.324427 -1.914627 1.736349
H  -0.308982 -0.471668 1.613123
H  0.087588 -3.112633 0.397782
H  -0.161586 -1.988622 -0.943891
H  -2.283849 -1.152651 -0.632436
H  2.241484 -2.297639 -0.383269
H  1.959644 -1.679536 1.279753
H  0.811747 0.272671 -0.477798
H  -3.150566 -0.066978 1.992856
H  -3.923876 -1.17269 0.964348
H  -2.53303 2.673624 -0.802373
H  -3.547216 1.41358 0.002483
H  1.851586 2.134018 -1.131512
H  3.59303 2.323997 -1.101647
H  4.185033 -1.018221 0.170147
H  4.955606 0.449474 -0.355316
