program: Gaussian 09
title: 000052540
version: EM64L-G09RevD.01
frameworkgroup: C1[X(C12H23NO2S2)]
method: RPBEPBE
basis: SDD
operation: Freq
keyword: #p
keyword: freq=noraman
keyword: PBEPBE/SDD
title: #p freq=noraman PBEPBE/SDD
converged: YES YES NO NO
title: Mulliken charges:
elementType: S S O O N C C C C C C C C C C C C H H H H H H H H H H H H H H H H H H H H H H H
charge: 0.156143 -0.017203 -0.417972 -0.231735 0.015245 -0.343247 -0.357979 -0.351429 -0.375368 -0.675854 -0.487099 -0.361458 -0.374394 -0.456174 0.171843 -0.641455 -0.641912 0.187291 0.207042 0.193491 0.186990 0.204852 0.246229 0.218474 0.215884 0.250738 0.295489 0.252721 0.252277 0.257562 0.211195 0.249627 0.226214 0.205828 0.254513 0.218654 0.214140 0.245901 0.220085 0.374853
chargesum: 0.00000
title: Mulliken charges with hydrogens summed into heavy atoms:
elementType: S S O O N C C C C C C C C C C C C
charge: 0.156143 -0.017203 -0.043119 -0.231735 0.015245 0.051086 0.022501 0.099651 0.058990 -0.129627 0.017899 0.107298 0.101447 -0.456174 0.171843 0.037540 0.038214
polarizability: 2.16269387e+02 1.26177465e+01 1.79994879e+02 -1.74445665e+01 1.41062049e+01 1.51477122e+02
1716.lowfreq: -6.7279 -0.0026 -0.0017 -0.0011 3.7555 8.0883 11.5795 17.5885 19.4019
frequency: 9.8765 17.0467 18.5263 37.1420 57.5842 63.0351 66.0777 77.8981 84.3741 89.3090 122.3189 135.9581 140.7635 157.5953 188.9235 206.0850 210.5016 252.8316 286.7585 291.5029 323.2021 337.1704 360.1105 368.7143 414.9493 464.5948 469.3880 483.2713 501.1520 537.3761 576.3813 588.4453 617.4393 637.9418 726.8557 751.2200 761.7923 779.7541 803.4058 812.5095 839.8906 860.1505 905.6265 936.1387 960.7530 982.3322 1009.3259 1021.6017 1043.4039 1064.1741 1068.8568 1076.9702 1079.3670 1092.7153 1094.6489 1104.1099 1123.0861 1145.6201 1192.2128 1197.6592 1219.0427 1235.6076 1258.6013 1263.7328 1269.2928 1285.5886 1292.1058 1294.2962 1299.9639 1305.3184 1340.2662 1345.9419 1352.3975 1361.5829 1373.7877 1381.3670 1387.8622 1409.1387 1420.2267 1437.1311 1455.8678 1460.3067 1464.3394 1465.2836 1468.1634 1471.4758 1480.7898 1483.2322 1484.6839 1499.2131 1668.8232 2952.2454 2959.1556 2964.3720 2985.7516 2985.9559 2987.7070 2993.7723 2995.7000 3000.2652 3003.4889 3005.8819 3017.9964 3030.6241 3044.1714 3058.8562 3062.1687 3065.2523 3083.6995 3084.3315 3084.9332 3100.4700 3101.6611 3510.8178
redmass: 4.8407 8.3755 5.3210 4.7164 3.4558 5.1997 1.9705 3.1303 3.0148 3.6292 3.1627 2.9144 1.9315 4.0797 3.6860 1.2761 1.0427 2.4093 3.8047 4.0639 3.3107 2.9106 4.5619 3.4800 3.5702 3.2881 3.9854 3.2750 1.7878 3.4855 5.1188 4.6389 4.7531 1.3181 1.0931 1.2505 1.6328 1.1795 1.6177 1.7096 1.5209 4.2165 3.0119 1.5207 2.7164 2.7836 2.8859 3.2083 2.7580 1.9672 2.2170 1.8705 2.0147 2.2656 1.8459 2.1276 1.3370 1.9312 1.4744 2.0855 1.3836 1.3725 1.3317 1.3829 1.2841 1.0835 1.1327 1.2137 1.1863 1.3747 1.2562 1.5366 1.2777 1.6713 1.8425 1.2108 1.2070 1.1178 1.8201 1.0848 1.0775 1.1339 1.0671 1.0450 1.0525 1.0924 1.0582 1.0703 1.0994 1.2460 8.2042 1.0592 1.0610 1.0641 1.0357 1.0611 1.0357 1.0910 1.0650 1.0614 1.0599 1.0610 1.0975 1.0988 1.1005 1.1021 1.1032 1.1008 1.1054 1.1000 1.0998 1.1017 1.1016 1.0639
irintensity: 0.7448 1.6925 0.8340 0.9025 0.1883 0.6251 0.2718 1.8661 0.1504 0.0923 0.5289 0.0203 0.2782 2.5970 1.8449 0.6895 0.1671 1.8516 5.1880 3.4388 1.2526 2.7345 18.3816 4.6507 8.8999 8.2427 5.0108 21.6499 28.0678 3.0510 2.3865 14.1518 7.0643 127.9801 19.0344 3.5212 4.9314 1.4875 13.4385 58.7222 3.3535 2.8920 52.4744 8.9829 42.5792 45.7747 13.8926 142.5122 29.8592 52.9183 17.2558 21.0871 12.7724 24.5823 12.2750 8.1817 2.8284 30.3363 12.5378 75.2613 4.1954 1.1993 8.2988 68.0930 21.5097 8.9074 1.2568 24.2332 20.1673 10.7935 7.3137 22.7393 21.4057 2.6127 29.4287 16.6553 24.1220 45.0613 106.6322 27.7666 5.0476 29.0324 0.1795 9.5402 3.8332 0.5639 5.6222 20.0014 22.7007 75.6716 205.1575 7.9015 9.3545 57.0847 33.9811 3.1749 24.5084 3.4779 35.1458 32.9171 35.5220 33.9223 9.4429 0.1571 39.8781 4.8407 81.6670 2.6780 4.6384 39.2170 31.3000 8.8486 44.0780 17.7721
temp: 298.150 k
press: 1.00000 atm
elementType: 16 16 8 8 7 6 6 6 6 6 6 6 6 6 6 6 6 1 1 1 1 1 1 1 1 1 1 1 1 1 1 1 1 1 1 1 1 1 1 1
symmnumber: 1
zpe: 883102.1 jmol-1
zpe.correction: 0.336356 hartree
zpe.thermalcorrener: 0.358190 hartree
zpe.thermalcorrenthalpy: 0.359134 hartree
zpe.thermalcorrgfe: 0.280025 hartree
zpe.sumelectzpe: -1471.038308 hartree
zpe.sumelectthermal: -1471.016474 hartree
zpe.sumelectthermalent: -1471.015530 hartree
zpe.sumelectthermalfe: -1471.094639 hartree
dipole: 1.0955 2.0470 -0.2736
dipole: 2.3377
quadrupole: -108.2082 -117.6764 -122.8768
quadrupole: 19.0457 6.6406 -7.2471
quadrupole: 8.0456 -1.4226 -6.6230 19.0457 6.6406 -7.2471
hfenergy: -1471.3746639 hartree
pointgroup: C01 [X(C12H23N1O2S2)]
dipole: -0.3854176 -0.74736 -0.3725554 debye
polarizability: 217.9619254|8.4489031|187.2796501|14.2469145|1.5734766|142.4998124 unknown
InChI: InChI=1S/C12H23NO2S2/c1-3-13(4-2)12(16)17-10-8-6-5-7-9-11(14)15/h14H,3-10H2,1-2H3
charge 0 multiplicity 1
40 atoms
S  -1.574791 -0.495758 1.722978
S  -3.3288 1.678275 0.279885
O  7.076063 0.783964 -1.775234
O  6.388142 -0.868664 -0.297958
N  -3.706188 -1.024548 0.129155
C  1.511663 0.800773 1.219142
C  2.574166 1.353922 0.243483
C  0.243751 1.679465 1.275482
C  3.845154 0.478869 0.179861
C  -0.84259 1.171439 2.235676
C  4.890922 1.048476 -0.796892
C  -4.843928 -0.791884 -0.804053
C  -3.433901 -2.448826 0.468139
C  -2.988324 0.034289 0.623731
C  6.146583 0.204689 -0.891984
C  -6.177558 -0.578226 -0.05974
C  -2.449243 -3.120311 -0.513138
H  1.951972 0.718536 2.235204
H  1.229114 -0.227162 0.913949
H  2.128474 1.435938 -0.769975
H  2.848375 2.386389 0.547182
H  0.522043 2.703083 1.606261
H  -0.197872 1.788101 0.266489
H  3.578513 -0.550802 -0.126206
H  4.293205 0.390873 1.188272
H  -0.453497 0.985968 3.253011
H  -1.698791 1.867942 2.276654
H  4.471245 1.143105 -1.818233
H  5.192706 2.074067 -0.506394
H  -4.606636 0.097987 -1.411697
H  -4.902091 -1.67049 -1.473564
H  -3.048905 -2.506412 1.501371
H  -4.40641 -2.974689 0.456756
H  -6.430666 -1.445205 0.577618
H  -6.114101 0.322056 0.574261
H  -6.997484 -0.435658 -0.78706
H  -2.827842 -3.078624 -1.550425
H  -1.465929 -2.621495 -0.480333
H  -2.309687 -4.182703 -0.241875
H  7.885846 0.205749 -1.818597
