program: Gaussian 09
title: 000052529
version: EM64L-G09RevD.01
frameworkgroup: C1[X(C15H11ClN2O2)]
method: RPBEPBE
basis: SDD
operation: Freq
keyword: #p
keyword: freq=noraman
keyword: PBEPBE/SDD
title: #p freq=noraman PBEPBE/SDD
converged: YES YES NO NO
title: Mulliken charges:
elementType: Cl O O N N C C C C C C C C C C C C C C C H H H H H H H H H H H
charge: -0.005207 -0.253324 -0.415420 -0.069080 -0.015195 0.340818 0.353770 0.137968 -0.347340 -0.398080 -0.311981 -0.374972 0.320191 -0.355112 -0.365901 -0.281651 -0.306871 0.230851 -0.303396 -0.536535 0.256029 0.271152 0.280204 0.274525 0.258965 0.247115 0.278038 0.226117 0.252293 0.226684 0.385345
chargesum: 0.00000
title: Mulliken charges with hydrogens summed into heavy atoms:
elementType: Cl O O N N C C C C C C C C C C C C C C C
charge: -0.005207 -0.253324 -0.030074 -0.069080 -0.015195 0.340818 0.353770 0.137968 -0.091311 -0.126928 -0.031777 -0.100448 0.320191 -0.096146 -0.118786 -0.281651 -0.028833 0.230851 -0.303396 0.168559
polarizability: 4.87115687e+02 -5.39256326e+01 2.44944204e+02 1.69653746e+00 -3.76870717e+00 9.19637841e+01
1716.lowfreq: -4.2746 -0.0009 0.0012 0.0018 2.6623 3.8911 33.3724 43.2818 44.8744
frequency: 33.3699 43.2768 44.8713 58.2534 112.9651 116.9390 135.7126 154.8160 172.8458 174.9384 197.8917 208.6867 232.6566 248.0137 267.3797 323.2343 341.6860 375.4197 387.6603 411.3314 417.9963 437.9781 459.2378 487.9655 510.7221 516.4046 553.7275 564.4506 596.3550 621.9727 626.7916 655.9535 701.4842 731.2081 745.8180 770.2058 806.5978 813.9591 840.9263 844.9830 888.6450 925.4029 930.0783 950.3307 970.1428 982.1483 997.6270 1003.6732 1004.7141 1049.1070 1111.7538 1121.7728 1156.2208 1158.0207 1184.1996 1229.2074 1244.7517 1261.8884 1282.3337 1305.4545 1330.7349 1368.6283 1385.6671 1421.0657 1432.7067 1437.3516 1461.6704 1468.6353 1470.8917 1498.1191 1531.4499 1548.3122 1560.8404 1607.0863 1623.6298 2138.1310 2967.4540 3059.1955 3133.3156 3143.5589 3144.8301 3158.2386 3159.6698 3168.5147 3174.5111 3185.4504 3565.6411
redmass: 9.0058 5.9667 4.3210 5.9520 4.1007 11.9867 5.1590 4.9386 8.9362 6.4206 4.8163 2.7293 2.0354 4.1010 4.9501 4.5277 5.6411 7.8336 10.3963 6.6449 3.1613 1.8846 5.7949 4.6986 1.7553 3.4681 5.5732 4.2461 5.9577 7.1193 6.8031 4.9989 6.6410 3.9795 4.3427 5.9261 6.0438 1.3352 1.6085 1.5389 1.4794 6.1822 10.1011 1.3537 1.3544 8.6166 2.5621 1.3437 3.1377 5.4251 1.2591 1.3884 1.4304 1.3263 1.3010 1.4730 2.5851 2.2688 1.8086 1.3992 2.2512 4.0653 2.1797 4.9984 3.6079 1.2287 3.5208 1.0573 1.1277 2.5561 5.9157 8.4188 6.9402 6.3228 6.5707 12.6432 1.0327 1.1044 1.0999 1.0894 1.0882 1.0894 1.0906 1.0950 1.0963 1.0965 1.0674
irintensity: 0.0914 0.0967 0.8466 0.7541 5.1462 2.0314 2.3236 1.4800 0.1292 1.6016 1.6678 0.1433 0.4363 4.4596 1.0730 5.8283 5.5966 4.7117 0.5536 29.3589 2.6920 95.2334 10.8450 24.1201 51.7183 6.2690 8.3870 28.3288 22.3949 3.3256 4.5695 4.1056 50.1733 0.6189 7.7325 19.8836 20.2857 28.8294 68.7296 10.0905 26.0748 74.7066 371.3937 1.2368 1.2102 65.4395 5.0518 6.5491 81.5452 14.4998 0.2207 14.2809 5.7240 5.0567 225.3111 56.8723 210.5444 52.2150 139.2133 2.4189 5.0552 57.5633 73.0599 4.7464 16.2486 22.5185 17.6201 17.7934 53.5098 88.7687 8.3150 38.7750 18.6069 144.5913 159.4029 66.8478 79.2746 40.8649 26.4536 1.6045 6.7261 0.6792 3.9600 8.8704 8.1584 1.9551 218.5074
temp: 298.150 k
press: 1.00000 atm
elementType: 17 8 8 7 7 6 6 6 6 6 6 6 6 6 6 6 6 6 6 6 1 1 1 1 1 1 1 1 1 1 1
symmnumber: 1
zpe: 584073.5 jmol-1
zpe.correction: 0.222462 hartree
zpe.thermalcorrener: 0.240685 hartree
zpe.thermalcorrenthalpy: 0.241629 hartree
zpe.thermalcorrgfe: 0.175043 hartree
zpe.sumelectzpe: -1296.712152 hartree
zpe.sumelectthermal: -1296.693929 hartree
zpe.sumelectthermalent: -1296.692984 hartree
zpe.sumelectthermalfe: -1296.759571 hartree
dipole: -3.8678 -6.6494 0.3872
dipole: 7.7022
quadrupole: -106.5609 -124.3257 -123.1061
quadrupole: 2.4735 -5.8250 -3.7652
quadrupole: 11.4367 -6.3281 -5.1085 2.4735 -5.8250 -3.7652
hfenergy: -1296.9346136 hartree
pointgroup: C01 [X(C15H11Cl1N2O2)]
dipole: 1.5317543 -2.4515004 -0.9091172 debye
polarizability: 486.5405202|48.5662123|228.03787|26.9103797|48.5792882|109.4452851 unknown
InChI: InChI=1S/C15H11ClN2O2/c1-20-12-5-2-10(3-6-12)13(9-17)11-4-7-15(18-19)14(16)8-11/h2-8,19H,1H3
charge 0 multiplicity 1
31 atoms
Cl -5.109828 1.288471 -0.225077
O  5.49881 -0.702177 0.019275
O  -4.563911 -3.093232 -0.693469
N  -4.746964 -1.661243 -0.532578
N  -0.096585 3.653305 1.168434
C  1.472499 0.616092 0.297628
C  -1.098311 0.397526 0.199126
C  0.092132 1.130337 0.429809
C  2.510569 1.11662 1.144448
C  1.833811 -0.332534 -0.702051
C  -2.384742 1.07705 0.133039
C  -1.111422 -1.053424 0.063966
C  4.159287 -0.313179 0.047362
C  3.827631 0.655486 1.032165
C  3.156549 -0.798239 -0.832257
C  -3.544811 0.380662 -0.111364
C  -2.276866 -1.750239 -0.161533
C  -3.561556 -1.068891 -0.290708
C  -0.02236 2.505915 0.827303
C  5.908549 -1.691365 -0.985017
H  2.2686 1.866263 1.905728
H  1.083249 -0.667681 -1.424883
H  -2.421191 2.163931 0.255277
H  -0.176908 -1.602251 0.209656
H  4.6193 1.027413 1.688858
H  3.397495 -1.511119 -1.626092
H  -2.282601 -2.841276 -0.224935
H  5.368241 -2.647503 -0.847793
H  6.983522 -1.843367 -0.812724
H  5.744207 -1.31032 -2.010955
H  -5.491396 -3.408033 -0.849339
