program: Gaussian 09
title: 000052485
version: EM64L-G09RevD.01
frameworkgroup: C1[X(C21H25N3O)]
method: RPBEPBE
basis: SDD
operation: Freq
keyword: #p
keyword: freq=noraman
keyword: PBEPBE/SDD
title: #p freq=noraman PBEPBE/SDD
converged: YES YES NO NO
title: Mulliken charges:
elementType: O N N N C C C C C C C C C C C C C C C C C C C C C H H H H H H H H H H H H H H H H H H H H H H H H H
charge: -0.437661 -0.132838 -0.520776 -0.046387 -0.476821 0.336315 -0.322919 -0.306842 -0.532403 0.493434 0.073308 0.337116 -0.692421 -0.675705 0.237155 -0.460178 -0.363971 -0.027623 -0.365604 -0.315696 -0.527711 0.473381 -0.398091 -0.397734 -0.809467 0.228471 0.232986 0.188029 0.221325 0.184355 0.202930 0.322781 0.236338 0.210616 0.210869 0.229872 0.209436 0.207788 0.301383 0.235242 0.217805 0.197346 0.253713 0.264371 0.228297 0.232387 0.355803 0.228578 0.231294 0.228123
chargesum: 0.00000
title: Mulliken charges with hydrogens summed into heavy atoms:
elementType: O N N N C C C C C C C C C C C C C C C C C C C C C
charge: -0.081858 -0.132838 -0.219393 -0.046387 -0.015364 0.336315 0.086435 0.080442 -0.209623 0.493434 0.073308 0.337116 -0.034598 -0.028609 0.237155 -0.224936 -0.146165 -0.027623 -0.168258 -0.061982 -0.263339 0.473381 -0.169794 -0.165347 -0.121472
polarizability: 4.01692335e+02 -2.54186353e+01 2.66915024e+02 2.24852777e+01 1.94246706e+01 1.71332143e+02
1716.lowfreq: -7.3182 -3.7547 -0.0007 -0.0005 0.0006 3.1509 14.8363 20.7229 36.4630
frequency: 14.5181 20.7151 36.4124 42.0606 47.7511 57.1190 72.2992 86.6249 97.5314 115.4558 128.6023 148.8591 170.9229 188.9238 198.8139 217.1675 233.5990 246.0222 269.8436 279.6717 290.2957 304.9417 307.3496 345.2602 350.0545 370.2180 421.3549 428.6225 435.2218 438.5627 454.2751 460.2011 486.4576 504.5008 509.7410 528.8287 538.8707 567.3936 596.4119 610.0435 631.9720 650.5498 702.3457 705.1699 737.6308 754.8102 758.9014 778.6872 784.9613 794.8442 801.1668 803.4648 815.2294 836.6620 849.9827 897.6403 905.0410 908.4486 927.6949 940.8999 950.2442 956.8192 962.2808 990.6575 999.7353 1004.2700 1045.3568 1049.4293 1060.4355 1074.8286 1082.2709 1084.9005 1088.6016 1114.7601 1152.6704 1159.2429 1166.1367 1173.4888 1176.9962 1202.8985 1227.2448 1235.4954 1252.6985 1255.4267 1266.8280 1275.4647 1286.7054 1294.0230 1307.5992 1342.5974 1355.6288 1358.0929 1364.2513 1373.5622 1383.1075 1388.7786 1390.4489 1396.5201 1401.4439 1423.3768 1435.7538 1449.4296 1459.7006 1465.9601 1468.6252 1470.4079 1474.0422 1475.1477 1478.1671 1479.2412 1486.7202 1493.3434 1502.0098 1530.5781 1558.3127 1587.5637 1608.2498 1622.8854 1633.2905 2850.3272 2859.4873 2895.6447 2975.0024 2983.0648 2983.8044 3016.1757 3022.4826 3041.8801 3051.1866 3074.9814 3077.2895 3086.2176 3089.4530 3092.8434 3106.0235 3111.0621 3113.0980 3134.8152 3137.8301 3150.6845 3156.0500 3181.7496 3550.6815 3583.0770
redmass: 3.8268 4.1091 3.6871 4.9082 3.3753 1.1110 3.7732 2.2161 2.1784 2.7823 4.3569 2.9958 3.3848 2.6234 1.8401 2.2532 2.1680 3.3834 3.4624 3.6775 1.8994 2.4535 3.5598 1.5405 1.9387 3.4218 3.8795 2.8872 3.6008 3.1871 4.2518 2.8860 1.8079 4.3746 2.4422 4.2895 4.4274 4.0563 4.7467 4.9446 5.5696 3.3231 4.5452 4.9710 4.7462 2.7667 4.1366 2.0537 2.5634 1.5654 1.1684 1.5867 2.3903 1.3258 5.6427 1.9242 1.3723 1.4541 2.9919 1.4566 1.5413 2.1289 1.5913 2.3066 1.6804 1.5248 2.7725 1.5631 2.7074 1.9881 2.2719 2.3064 2.0695 1.8718 1.5057 1.3129 1.7973 1.6173 1.5242 2.3075 1.7426 1.9619 1.5317 2.8646 1.2831 2.1492 1.2250 1.3474 2.1454 2.0099 2.0068 1.9057 1.3529 1.4603 3.8589 1.2365 1.2339 1.3431 3.6260 3.8387 2.7137 1.9882 1.3047 1.0597 1.0466 1.0557 1.2812 1.0897 1.1004 2.0598 1.0630 1.0739 2.8478 3.7507 4.2283 5.3585 5.4908 6.7037 6.3439 1.0723 1.0718 1.0706 1.0376 1.0358 1.0359 1.0859 1.0879 1.0875 1.0974 1.0987 1.0976 1.1001 1.0984 1.1003 1.0853 1.0875 1.0901 1.0961 1.0965 1.0924 1.0914 1.0930 1.0747 1.0660
irintensity: 0.5851 0.0990 0.7454 0.3404 0.3970 0.2468 0.3795 0.2879 0.9462 0.9366 0.9767 0.8495 0.5598 2.6702 1.6632 5.1117 1.9927 1.2835 1.6564 2.0625 2.9304 0.7203 7.1935 61.5923 66.0168 8.4236 2.4894 2.6637 17.1308 7.1249 2.1245 4.3989 56.0985 12.7764 50.4760 44.5935 1.9881 4.1523 6.7878 1.1481 1.9700 12.0844 2.3738 4.2652 9.8148 6.1619 9.5765 12.0874 33.5034 23.3786 8.1875 16.7734 21.9830 44.3601 15.3975 2.6799 2.2786 11.7035 3.6226 3.7817 3.0528 3.5012 3.1945 10.1970 12.9071 12.8921 14.8520 12.1579 33.3237 17.9692 31.3185 3.6258 65.1199 14.6791 128.3531 20.1426 13.6936 17.3891 4.8256 32.0570 9.9685 13.5103 63.1509 27.2252 25.8910 11.3112 24.5665 4.5695 25.8691 54.8869 29.3408 17.3847 1.2867 0.3842 4.0470 16.5160 20.9667 39.0214 90.7890 7.2541 62.7534 72.1033 70.4035 11.5676 13.5891 9.9548 15.7526 15.6575 4.2381 95.7489 13.5240 8.6692 145.6290 211.5314 327.2540 99.8932 20.3653 12.9247 54.8484 33.1416 197.4198 68.6158 45.9157 26.6796 25.5518 10.4280 18.4285 10.2148 21.5410 21.1969 86.9062 62.4348 18.7973 34.4546 10.8602 25.9183 30.0279 28.5597 15.8835 9.1891 15.0156 12.0454 14.0905 47.7590
temp: 298.150 k
press: 1.00000 atm
elementType: 8 7 7 7 6 6 6 6 6 6 6 6 6 6 6 6 6 6 6 6 6 6 6 6 6 1 1 1 1 1 1 1 1 1 1 1 1 1 1 1 1 1 1 1 1 1 1 1 1 1
symmnumber: 1
zpe: 1086731.3 jmol-1
zpe.correction: 0.413914 hartree
zpe.thermalcorrener: 0.438492 hartree
zpe.thermalcorrenthalpy: 0.439437 hartree
zpe.thermalcorrgfe: 0.357510 hartree
zpe.sumelectzpe: -1052.887620 hartree
zpe.sumelectthermal: -1052.863042 hartree
zpe.sumelectthermalent: -1052.862098 hartree
zpe.sumelectthermalfe: -1052.944024 hartree
dipole: -2.2673 4.2107 0.8390
dipole: 4.8554
quadrupole: -135.1020 -132.4895 -152.4293
quadrupole: 5.7219 10.6327 -2.1572
quadrupole: 4.9050 7.5174 -12.4224 5.7219 10.6327 -2.1572
hfenergy: -1053.3015343 hartree
pointgroup: C01 [X(C21H25N3O1)]
dipole: 0.882306 -1.6462681 0.4005261 debye
polarizability: 401.5106429|-26.9979794|265.4285168|-20.9850441|-23.2631917|173.0003417 unknown
InChI: InChI=1S/C21H25N3O/c1-4-24(5-2)14-16-13-17(7-9-21(16)25)23-19-10-11-22-20-12-15(3)6-8-18(19)20/h6-13,23,25H,4-5,14H2,1-3H3
charge 0 multiplicity 1
50 atoms
O  4.94461 -2.510469 -0.064417
N  3.599632 1.51074 0.30929
N  -0.625868 -1.47143 -0.034409
N  -2.911983 1.946381 -1.276375
C  4.137531 0.138244 0.475801
C  3.115959 -0.951947 0.164587
C  3.55794 1.90523 -1.127254
C  4.292827 2.503583 1.173977
C  1.73212 -0.685376 0.17473
C  0.779313 -1.704499 -0.086448
C  3.549814 -2.280875 -0.087556
C  -1.337288 -0.327711 -0.408353
C  2.599154 3.075959 -1.415603
C  3.88493 2.39632 2.656082
C  -2.734064 -0.209616 -0.021206
C  1.235032 -3.023294 -0.340805
C  2.615045 -3.311622 -0.329655
C  -3.476918 0.936723 -0.501158
C  -3.415056 -1.155852 0.810307
C  -0.784392 0.712142 -1.183983
C  -4.863453 1.061118 -0.165732
C  -5.522535 0.114772 0.627151
C  -4.767387 -1.000624 1.123028
C  -1.60378 1.805534 -1.578374
C  -6.992736 0.252482 0.978979
H  4.466612 0.013373 1.525001
H  5.04948 -0.035559 -0.143649
H  4.58208 2.150328 -1.50935
H  3.216276 1.019935 -1.695675
H  5.405853 2.420503 1.079211
H  4.02295 3.511098 0.811035
H  1.42975 0.337542 0.417528
H  1.586605 2.843117 -1.041037
H  2.927632 4.016701 -0.938836
H  2.540664 3.261068 -2.504389
H  2.793162 2.522338 2.758501
H  4.15689 1.41832 3.093023
H  4.390628 3.178894 3.252038
H  -1.188248 -2.276453 0.242922
H  0.514424 -3.820903 -0.556737
H  2.957798 -4.336732 -0.521942
H  -2.875761 -2.005053 1.249374
H  0.251726 0.671697 -1.525456
H  -5.386055 1.940151 -0.557524
H  -5.263309 -1.734943 1.769682
H  -1.165296 2.603176 -2.191606
H  5.145767 -3.453532 -0.2845
H  -7.138872 0.309078 2.074474
H  -7.431501 1.160102 0.531656
H  -7.573702 -0.618061 0.619353
