program: Gaussian 09
title: 000006749
version: EM64L-G09RevD.01
frameworkgroup: C1[X(C10H8O2)]
method: RPBEPBE
basis: SDD
operation: Freq
keyword: #pfreq=noraman
keyword: PBEPBE/SDD
title: #p freq=noraman PBEPBE/SDD
converged: YES YES NO NO
title: Mulliken charges:
elementType: O O C C C C C C C C C C H H H H H H H H
charge: -0.424236 -0.438287 0.321758 0.210660 0.108876 0.165083 -0.391638 -0.407743 -0.373720 -0.434301 -0.241202 -0.196941 0.185126 0.273320 0.250118 0.220876 0.227037 0.229516 0.354848 0.360850
chargesum: 0.00000
title: Mulliken charges with hydrogens summed into heavy atoms:
elementType: O O C C C C C C C C C C
charge: -0.069389 -0.077437 0.321758 0.210660 0.108876 0.165083 -0.206512 -0.134423 -0.123602 -0.213425 -0.014165 0.032575
polarizability: 1.58596806e+02 1.20780598e+01 1.42680877e+02 -1.95377639e-03 -8.79664359e-03 4.52387980e+01
1716.lowfreq: -10.3757 -8.5520 -0.0008 -0.0005 0.0004 7.8242 78.7612 170.9501 183.0180
frequency: 78.7610 170.9501 183.0177 245.3730 254.3969 288.8915 342.6644 378.3034 448.8687 464.7462 504.6056 506.4748 509.9407 533.8401 585.2941 633.7014 662.8364 717.3021 772.4709 773.3733 814.0382 843.4993 849.9826 903.3855 903.4035 941.5215 980.1349 1050.8690 1072.3349 1115.6166 1143.5623 1174.2616 1179.9596 1210.1932 1245.5511 1250.6219 1286.1295 1387.4076 1416.2906 1427.1300 1446.7157 1459.1394 1528.3360 1587.7670 1604.2091 1640.9519 3100.3852 3120.0496 3142.0821 3157.4835 3171.2823 3184.1593 3585.2897 3590.8860
redmass: 3.1765 3.9460 2.2105 2.7967 5.5785 2.2599 5.5984 1.1292 6.9653 3.3730 4.4652 5.4546 5.4097 5.6210 3.1219 6.7774 4.4106 1.4213 5.6730 1.7248 2.2430 1.4464 4.5921 1.4501 5.6078 1.3210 1.3238 2.0241 2.1869 1.8167 1.3279 1.1444 1.2772 1.9258 1.8260 2.0485 2.1692 2.5307 3.5910 3.3205 3.1865 2.8266 4.2700 7.0949 6.2601 6.8161 1.0876 1.0900 1.0878 1.0975 1.0929 1.0972 1.0659 1.0654
irintensity: 6.9947 5.9485 26.4502 34.3690 0.6137 79.8015 18.2242 120.2831 1.8146 0.0142 0.7452 10.6556 1.4204 1.4844 8.0218 7.0769 0.0125 26.2035 10.5102 127.8498 31.5974 4.3016 3.3419 3.5919 97.2011 0.7227 2.6617 79.7954 18.3383 52.6055 127.6207 6.4101 14.2887 130.2462 39.6287 47.4056 7.1041 59.8374 1.8062 61.2277 8.7789 7.2667 109.3915 16.0766 27.5813 0.2696 13.8885 22.4638 12.7134 22.3564 6.5537 8.9826 38.6196 22.5189
temp: 298.150 k
press: 1.00000 atm
elementType: 8 8 6 6 6 6 6 6 6 6 6 6 1 1 1 1 1 1 1 1
symmnumber: 1
zpe: 398179.7 jmol-1
zpe.correction: 0.151659 hartree
zpe.thermalcorrener: 0.161303 hartree
zpe.thermalcorrenthalpy: 0.162247 hartree
zpe.thermalcorrgfe: 0.117090 hartree
zpe.sumelectzpe: -535.475689 hartree
zpe.sumelectthermal: -535.466045 hartree
zpe.sumelectthermalent: -535.465101 hartree
zpe.sumelectthermalfe: -535.510258 hartree
dipole: 2.7570 1.5460 -0.0047
dipole: 3.1609
quadrupole: -59.3040 -59.9895 -75.1000
quadrupole: 1.8265 0.0221 -0.0219
quadrupole: 5.4938 4.8084 -10.3022 1.8265 0.0221 -0.0219
hfenergy: -535.6273481 hartree
pointgroup: C01 [X(C10H8O2)]
dipole: 1.1370748 -0.5035593 -0.0031488 debye
dipolederiv: -0.5559447 -0.5396402 0.0123462 -0.709186 -0.936774 0.0166042 0.0141785 0.0134211 -0.4128974 -0.5831974 -0.5645811 0.0107891 -0.7549756 -0.9257121 0.0172756 0.0135779 0.0147744 -0.4086718 -0.031911 -0.3486775 0.0063993 -0.0544916 -0.0168529 0.0014656 0.0008107 0.0048409 0.0202007 -0.1163769 -0.256744 0.005943 -0.2144717 0.0825172 0.0015673 0.0056987 0.0018905 0.0330969 0.4164222 0.5558475 -0.0142585 0.7464806 0.8812846 -0.022859 -0.0172045 -0.0202991 0.0616999 0.5938502 0.4902933 -0.0139227 0.739742 0.8749471 -0.0217235 -0.0180084 -0.0186748 0.0628547 -0.2112224 0.1001384 -0.0015249 0.0262314 -0.0645808 -0.0027729 0.0000428 -0.0035182 -0.2238318 -0.2312916 0.1341419 -0.0016109 0.062973 -0.1155158 -0.0019439 -0.0004885 -0.0027195 -0.1897345 0.0618656 0.1368781 -0.0052148 -0.2798597 -0.2537312 0.0045666 0.0022596 -0.0000077 -0.1875556 -0.0152739 0.1649105 -0.005071 -0.2986177 -0.3206265 0.0049196 0.0024183 -0.0005957 -0.229067 0.166496 -0.0386842 -0.0029366 0.1840963 0.1423826 -0.006411 -0.0064994 -0.0037134 -0.1360544 0.178491 -0.0934579 -0.0023184 0.1434443 0.1709904 -0.0072415 -0.0062922 -0.0045539 -0.1539124 -0.0127128 -0.1468551 0.0044945 -0.0841876 -0.0801455 0.0049004 0.0033373 0.0054476 0.1675844 0.0726963 -0.0739782 0.0023852 -0.0299774 0.0007651 0.0032424 0.0015968 0.0037749 0.1739415 -0.0812176 0.0004768 0.0030481 -0.004125 0.1026334 0.0012368 0.0032322 0.0012359 0.1739644 -0.1470718 -0.0152768 0.0039935 -0.042684 0.0787871 0.0021462 0.0043622 0.0018206 0.1809801 0.0378575 0.0902097 -0.0000168 0.0904387 -0.0781863 0.0027398 0.0000983 0.0027355 0.1611113 0.035807 0.0946249 -0.0001997 0.0977845 -0.0794728 0.0028741 -0.0003347 0.002887 0.1570341 0.2568762 0.1941522 -0.0032053 0.1699207 0.2466744 0.00054 -0.0022695 0.0010418 0.3651732 0.165858 0.1162217 0.0008808 0.2114648 0.290616 -0.0011268 -0.0005161 0.0002123 0.384084 unknown
polarizability: 160.7040727|-10.3924503|140.5354533|-1.1802602|-1.4629047|45.2769547 unknown
InChI: InChI=1S/C10H8O2/c11-9-5-1-3-7-8(9)4-2-6-10(7)12/h1-6,11-12H
charge 0 multiplicity 1
20 atoms
O  -2.643981 -1.664968 0.079519
O  2.503136 1.742698 -0.037018
C  -0.374902 -0.630291 0.034808
C  0.379902 0.605877 0.005608
C  -1.814565 -0.530545 0.050457
C  1.816645 0.516921 -0.009454
C  0.320979 -1.886142 0.046721
C  -0.292109 1.867679 -0.007713
C  -2.457446 0.710859 0.036876
C  2.477126 -0.715978 0.002921
C  1.716388 -1.923087 0.031001
C  -1.689722 1.910068 0.007581
H  -0.222764 -2.83988 0.0678
H  0.305394 2.782055 -0.029786
H  -3.550883 0.73643 0.04937
H  3.573468 -0.762274 -0.008803
H  2.240981 -2.884061 0.040128
H  -2.210408 2.873427 -0.002733
H  -2.115674 -2.50014 0.09148
H  3.481434 1.596853 -0.046963
