program: Gaussian 09
title: 000052604
version: EM64L-G09RevD.01
frameworkgroup: C1[X(C28H25N5O)]
method: RPBEPBE
basis: SDD
operation: Freq
keyword: #p
keyword: freq=noraman
keyword: PBEPBE/SDD
title: #p freq=noraman PBEPBE/SDD
converged: YES YES NO NO
title: Mulliken charges:
elementType: O N N N N N C C C C C C C C C C C C C C C C C C C C C C C C C C C C H H H H H H H H H H H H H H H H H H H H H H H H H
charge: -0.296048 -0.519250 -0.440138 -0.123647 -0.444806 -0.127670 0.209830 0.301520 0.407270 0.102478 -0.534837 0.480378 -0.396732 -0.523650 -0.430908 -0.479454 -0.402041 -0.390882 0.127254 -0.391896 -0.476639 0.365149 -0.303697 0.528805 -0.350195 -0.360459 0.337927 -0.388866 -0.371752 0.317364 -0.386573 -0.404841 -0.374769 -0.399228 0.232784 0.217784 0.226996 0.301924 0.252327 0.240717 0.228489 0.227248 0.274603 0.286995 0.228242 0.220488 0.229067 0.229522 0.213624 0.290490 0.225845 0.283077 0.222639 0.259401 0.267229 0.222379 0.233280 0.267357 0.258498
chargesum: 0.00000
title: Mulliken charges with hydrogens summed into heavy atoms:
elementType: O N N N N N C C C C C C C C C C C C C C C C C C C C C C C C C C C C
charge: -0.296048 -0.217326 -0.153143 -0.123647 -0.154317 -0.127670 0.209830 0.301520 0.407270 0.102478 -0.302053 0.480378 0.048048 -0.271323 -0.190191 -0.023718 -0.127438 0.057848 0.127254 -0.178272 -0.018050 0.365149 -0.077853 0.528805 -0.067117 -0.137820 0.337927 -0.129465 -0.104523 0.317364 -0.164194 -0.171561 -0.107412 -0.140730
polarizability: 9.46823852e+02 3.19037130e+01 3.39855186e+02 3.13997045e+01 -1.54032190e+01 1.97578750e+02
1716.lowfreq: -0.0018 -0.0003 0.0014 1.2520 1.8177 6.8859 11.7211 16.8364 18.0353
frequency: 11.4730 16.7392 18.0018 30.8310 35.8240 40.9165 53.6666 58.4449 70.3436 80.1521 98.1902 103.3971 120.2654 129.0605 134.9826 149.2107 176.8739 181.2396 195.5885 204.8514 220.9394 253.5401 298.7165 310.6366 326.5830 328.2502 344.0160 367.0820 380.4200 385.8976 407.7509 413.4571 415.9179 421.7020 443.6243 445.7849 453.7959 492.5990 508.3931 516.2441 518.1470 545.2876 587.0027 593.4998 613.1737 629.0744 647.5403 649.7363 654.3469 672.1942 684.7895 713.2627 723.2054 728.3185 731.3829 737.9316 750.0536 760.4713 801.4233 818.6822 826.8820 828.6717 830.6995 832.0135 834.9604 843.4134 854.5282 856.3652 861.7811 866.3241 869.8035 881.7054 883.3069 914.3082 939.1386 941.3789 945.9715 946.9421 952.7694 967.9567 968.5649 971.8102 982.0674 991.3134 991.7455 1001.7181 1004.9728 1024.2689 1029.4582 1074.7274 1078.6449 1084.4667 1095.6806 1112.8316 1117.0744 1132.8180 1154.2669 1161.0734 1166.3695 1167.3372 1175.4370 1196.0041 1205.2472 1208.7802 1209.8709 1218.5931 1226.7964 1235.0084 1239.3647 1264.6011 1267.9605 1278.5576 1281.0254 1296.0047 1300.7230 1312.4767 1317.3867 1326.3091 1326.4378 1346.4058 1363.9868 1373.7424 1392.3841 1396.3119 1412.8884 1426.0987 1432.3903 1435.5816 1462.9481 1466.9352 1471.1985 1491.2854 1495.0222 1496.7426 1503.0385 1507.1053 1538.0564 1564.7135 1571.8975 1575.7307 1581.3073 1592.5250 1608.5949 1621.9927 1633.7258 1642.9114 2962.1612 2965.2904 2992.8880 2995.3478 3035.5483 3036.4525 3057.0657 3059.6343 3085.2750 3101.9141 3129.5641 3132.0989 3133.2497 3135.6324 3141.0046 3157.9860 3160.8603 3164.2389 3170.3305 3170.5130 3177.0059 3215.1037 3568.7521 3581.2704 3602.5372
redmass: 5.6663 4.8328 4.2851 5.0471 5.7794 3.6918 4.0607 3.6195 4.5340 4.6822 4.7964 4.8815 5.5294 2.3635 2.1879 4.2372 4.7073 2.7829 5.8450 4.8959 3.9811 5.7804 4.2304 5.1370 5.2568 5.2729 5.6601 4.4904 4.2259 1.5101 2.1197 2.7146 2.9790 2.4768 2.9043 3.4418 3.5975 3.4769 2.1930 3.4068 1.3550 5.3852 4.9617 5.8837 6.3570 6.8964 5.6131 3.8078 3.7262 6.7069 4.1760 5.7027 3.6169 3.8500 4.1319 4.5388 2.7437 5.3173 1.5540 1.4924 3.0913 1.4448 1.4047 1.4310 1.4960 3.8124 1.6125 2.1373 2.8203 2.3218 2.8017 2.1812 5.4163 4.4219 3.3442 3.6423 2.1638 2.1270 1.3078 3.8258 1.3446 1.2219 1.3345 1.3444 3.9488 2.7771 2.9338 3.4017 3.4381 1.8954 1.6603 2.2668 2.3701 1.3980 1.4886 1.4784 2.1281 1.5464 1.1432 1.1390 1.2614 1.4461 1.6570 1.1073 1.1015 2.2108 2.5918 1.9582 1.5812 1.2774 1.3357 1.6057 1.5626 1.3866 1.3307 2.0049 1.4117 1.5923 1.7230 2.7968 4.1267 4.9098 3.4403 3.7718 3.6260 3.6394 2.5855 2.2928 1.6529 1.1365 2.0582 2.3451 2.4733 1.6980 1.3385 1.6431 4.9615 6.8159 6.3555 6.8978 6.5376 7.5424 5.9788 6.2505 7.0130 5.4732 1.0653 1.0646 1.0652 1.0656 1.0960 1.0965 1.1042 1.1043 1.0906 1.0871 1.0895 1.0915 1.0884 1.0876 1.0890 1.0886 1.0959 1.0950 1.0956 1.0958 1.0974 1.0974 1.0784 1.0788 1.0803
irintensity: 0.1235 0.8789 3.3096 3.0206 0.8481 2.2568 2.9317 2.0435 1.0423 1.5339 2.3547 3.8157 0.3740 1.1391 1.8653 2.3641 2.6692 0.7813 2.2697 7.4845 8.4690 5.2933 1.1495 1.6395 16.2682 4.2995 44.6210 8.0053 9.3894 95.5496 52.9361 16.4944 7.2004 39.7499 19.4611 7.9714 18.5495 36.6675 77.2387 3.4494 33.6931 7.0530 0.0119 2.2660 2.9055 0.3054 4.0527 37.7647 8.2985 0.5095 18.0697 1.0312 5.0773 8.5930 5.6463 6.4730 0.8841 1.2614 5.4255 26.5746 3.4350 23.8254 1.4158 2.1263 19.9404 40.4312 65.7172 37.3172 56.2457 17.9503 28.1558 1.8035 11.4567 2.3046 1.9191 17.6481 4.3389 41.1624 12.9152 25.5687 0.2037 40.6322 0.7049 0.7237 6.3080 14.9811 19.2389 3.7774 10.4723 10.7601 0.6135 22.2647 40.1562 11.1199 12.2829 9.0783 10.2889 56.0797 5.3140 6.1584 259.3385 2.5949 27.3083 0.5468 0.7134 564.3040 76.5902 377.8139 35.5374 3.2613 33.6847 62.8655 69.6356 1.3316 8.5760 8.0875 3.0613 22.0318 70.2182 38.4230 7.6181 6.7270 28.5601 56.6071 6.6210 3.1816 125.7782 323.0046 20.8191 12.4235 61.4389 393.2231 50.4395 13.5003 35.4988 55.6264 29.9138 8.4362 54.3441 8.5839 88.5827 14.3021 148.3305 106.2000 27.9905 26.5828 102.0712 94.7566 105.6228 79.2971 61.4660 47.0816 54.1002 51.4684 12.0498 47.1299 19.8477 16.9080 23.5239 13.4897 8.6306 1.6269 13.9106 4.4434 10.7579 6.5191 3.2631 3.9901 6.2115 9.8741 35.0549
temp: 298.150 k
press: 1.00000 atm
elementType: 8 7 7 7 7 7 6 6 6 6 6 6 6 6 6 6 6 6 6 6 6 6 6 6 6 6 6 6 6 6 6 6 6 6 1 1 1 1 1 1 1 1 1 1 1 1 1 1 1 1 1 1 1 1 1 1 1 1 1
symmnumber: 1
zpe: 1228677.8 jmol-1
zpe.correction: 0.467979 hartree
zpe.thermalcorrener: 0.497108 hartree
zpe.thermalcorrenthalpy: 0.498053 hartree
zpe.thermalcorrgfe: 0.403253 hartree
zpe.sumelectzpe: -1428.580446 hartree
zpe.sumelectthermal: -1428.551316 hartree
zpe.sumelectthermalent: -1428.550372 hartree
zpe.sumelectthermalfe: -1428.645171 hartree
dipole: -2.0958 5.3696 2.6158
dipole: 6.3299
quadrupole: -221.8869 -172.1606 -199.7220
quadrupole: 12.0925 -22.8681 -0.7776
quadrupole: -23.9637 25.7626 -1.7989 12.0925 -22.8681 -0.7776
hfenergy: -1429.0484243 hartree
pointgroup: C01 [X(C28H25N5O1)]
dipole: -0.7689348 -2.1444357 -1.0060236 debye
polarizability: 948.4060699|-18.6368474|338.2630176|-24.5135885|-18.2027236|197.5887001 unknown
InChI: InChI=1S/C28H25N5O/c1(8-23-17-21-4-5-22(18-26(21)33-23)28-31-15-16-32-28)19-2-9-24(10-3-19)34-25-11-6-20(7-12-25)27-29-13-14-30-27/h1-12,17-18,29,31,33H,13-16H2
charge 0 multiplicity 1
59 atoms
O  -4.691403 2.147844 0.377193
N  4.06873 -0.336747 0.405976
N  9.00859 -2.541365 0.480318
N  10.268983 -0.634389 0.148198
N  -8.699274 -2.862987 -1.160616
N  -9.676007 -2.021236 0.75253
C  5.416997 -0.096012 0.134548
C  5.499267 1.211073 -0.475107
C  7.814781 -0.379622 -0.01164
C  9.054178 -1.160108 0.191313
C  6.552483 -0.896141 0.371193
C  3.286789 0.765666 -0.010229
C  10.391981 -3.079165 0.470154
C  4.16109 1.728199 -0.557019
C  6.782533 1.710068 -0.841922
C  11.231355 -1.747277 0.439285
C  7.915912 0.921204 -0.608462
C  -9.963424 -3.637325 -1.093111
C  -8.685723 -1.91569 -0.119409
C  1.847124 0.748573 0.165363
C  -10.519344 -3.179866 0.307637
C  -7.61221 -0.903043 -0.010782
C  0.993036 1.764881 -0.191812
C  -0.464208 1.791947 -0.035867
C  -7.781486 0.186692 0.885684
C  -6.417569 -0.982647 -0.772921
C  -5.60335 1.071993 0.249097
C  -6.787067 1.17068 1.01714
C  -5.411959 -0.00063 -0.651958
C  -3.29894 1.955235 0.204875
C  -1.220238 0.726969 0.541796
C  -1.182489 2.944301 -0.474252
C  -2.618193 0.800394 0.66567
C  -2.581861 3.032404 -0.358616
H  6.46759 -1.866143 0.874048
H  10.574915 -3.703088 -0.428697
H  10.599604 -3.687871 1.367673
H  3.694825 -1.17585 0.844582
H  3.864352 2.692848 -0.965276
H  6.882178 2.699923 -1.29988
H  11.709906 -1.554159 1.418429
H  12.02958 -1.765618 -0.323495
H  8.918164 1.273458 -0.869828
H  8.219197 -3.121566 0.196888
H  -9.777934 -4.724831 -1.139268
H  -10.648392 -3.361642 -1.920632
H  -11.580638 -2.878593 0.264583
H  -10.432058 -3.989305 1.05709
H  1.431677 -0.16157 0.622524
H  -8.209226 -2.719274 -2.042466
H  1.431987 2.664603 -0.645911
H  -8.70337 0.231468 1.473229
H  -6.247161 -1.82606 -1.451664
H  -6.905543 2.016457 1.700577
H  -4.499737 -0.065104 -1.252632
H  -0.711439 -0.169922 0.91138
H  -0.628137 3.781254 -0.915567
H  -3.177317 -0.01922 1.127901
H  -3.129405 3.918234 -0.693239
