program: Gaussian 09
title: 000052413
version: EM64L-G09RevD.01
frameworkgroup: C1[X(C5H9ClO2)]
method: RPBEPBE
basis: SDD
operation: Freq
keyword: #p
keyword: freq=noraman
keyword: PBEPBE/SDD
title: #p freq=noraman PBEPBE/SDD
converged: YES YES NO NO
title: Mulliken charges:
elementType: Cl O O C C C C C H H H H H H H H H
charge: -0.038005 -0.431166 -0.184586 -0.126227 -0.336242 -0.652433 -0.680842 0.207226 0.231451 0.224020 0.244850 0.237360 0.238216 0.217733 0.223159 0.238807 0.386679
chargesum: 0.00000
title: Mulliken charges with hydrogens summed into heavy atoms:
elementType: Cl O O C C C C C
charge: -0.038005 -0.044487 -0.184586 -0.126227 0.119229 0.067993 -0.001143 0.207226
polarizability: 7.30245868e+01 -2.99378910e+00 6.28644872e+01 -4.72353359e+00 3.35701823e+00 6.90412800e+01
1716.lowfreq: -12.3141 0.0000 0.0019 0.0021 10.3304 20.1978 41.5460 98.3422 171.9833
frequency: 41.4961 98.1725 171.9828 201.9158 219.1608 244.9476 265.0024 313.3695 319.5264 384.4607 429.7760 523.2322 587.9020 594.2799 717.4812 739.1891 817.8720 873.1745 1004.2024 1005.9335 1036.5467 1054.3189 1118.9250 1153.3309 1180.7345 1266.8093 1289.4048 1336.5580 1392.7566 1396.1055 1444.3557 1464.1808 1474.1157 1477.9944 1483.3033 1679.3535 2988.2809 2995.0289 3000.4120 3053.1744 3082.6783 3097.9197 3104.6941 3110.6775 3518.8685
redmass: 9.9741 2.4683 2.8601 1.5840 4.6883 1.0755 1.9817 3.0310 3.0396 8.1784 3.1633 4.9785 1.3913 2.5027 4.0821 2.2947 1.5721 2.0129 2.2123 1.5606 3.1049 1.5887 2.5671 2.4801 2.0137 1.4578 1.5579 1.4956 1.1914 1.2089 1.0750 1.0575 1.0513 1.0385 1.0512 9.7660 1.0364 1.0585 1.0361 1.1007 1.0997 1.1004 1.1003 1.1011 1.0643
irintensity: 0.1423 0.1275 0.5208 0.7251 0.4892 0.0474 0.2861 1.2245 3.9057 0.2558 1.5315 8.3157 108.5523 77.0140 28.6062 10.5662 39.1447 1.0329 167.0816 108.1688 2.2016 5.3044 4.2544 4.6774 6.3612 6.5101 0.3631 7.7242 2.9456 26.4111 4.5748 14.8365 8.1840 17.7265 7.2173 193.3669 26.2412 9.6221 16.9223 3.4757 42.3756 16.8395 16.0509 16.6410 29.1590
temp: 298.150 k
press: 1.00000 atm
elementType: 17 8 8 6 6 6 6 6 1 1 1 1 1 1 1 1 1
symmnumber: 1
zpe: 351424.6 jmol-1
zpe.correction: 0.133851 hartree
zpe.thermalcorrener: 0.143484 hartree
zpe.thermalcorrenthalpy: 0.144428 hartree
zpe.thermalcorrgfe: 0.098906 hartree
zpe.sumelectzpe: -805.800147 hartree
zpe.sumelectthermal: -805.790513 hartree
zpe.sumelectthermalent: -805.789569 hartree
zpe.sumelectthermalfe: -805.835092 hartree
dipole: -1.7668 1.4554 2.7099
dipole: 3.5473
quadrupole: -50.8943 -54.4355 -58.6682
quadrupole: 1.2739 1.5241 -3.1243
quadrupole: 3.7717 0.2305 -4.0022 1.2739 1.5241 -3.1243
hfenergy: -805.9339976 hartree
pointgroup: C01 [X(C5H9Cl1O2)]
dipole: 0.02207 -0.3146827 1.3594824 debye
dipolederiv: -0.2293477 0.0154677 -0.1308873 0.0156574 -0.2718654 0.1426042 -0.1054644 0.126819 -0.4975777 -0.5436176 0.1302586 -0.4047678 0.1172232 -0.5232953 0.3377196 -0.2804896 0.2399663 -0.8502941 -0.5577741 0.1495728 0.2729434 0.1853882 -0.3623284 -0.1116433 0.0871472 0.0234963 -0.8139593 0.1277857 0.0472838 0.1823718 0.041969 0.2555195 -0.2023643 0.3023388 -0.3240964 0.5906164 0.0707672 0.0136523 -0.0331321 0.050862 0.0192059 -0.0085551 -0.027245 0.0534459 -0.0231251 -0.0533462 0.0004361 -0.0381409 -0.0257076 -0.0575742 0.002985 -0.0630098 0.0011422 -0.0608983 0.0398054 -0.0649182 -0.0213655 -0.0642163 -0.0277423 -0.0538367 -0.0013186 -0.0200841 0.0133567 0.9081992 -0.4865257 0.0214765 -0.5055556 0.4725475 -0.1660441 -0.0478278 -0.1091074 1.2602161 -0.0641741 0.0808281 0.0581946 0.0774447 -0.0389761 -0.044201 0.0386045 -0.0457792 0.0829338 0.0589307 -0.0325955 -0.0604485 -0.0117993 0.040188 0.0538849 -0.0684489 0.0305231 -0.0944876 0.0043437 -0.1048934 0.0482422 -0.095167 0.0088211 0.0105253 0.0668812 0.0548414 0.0589713 0.0905682 0.0180492 -0.0651303 0.0086295 0.06809 0.0526462 -0.077715 0.0462023 -0.0595855 -0.0525853 0.1023317 0.0472937 0.0765488 0.034646 -0.0466696 0.0348946 -0.0444801 0.0874463 -0.0513247 -0.1258255 0.0771693 -0.1145907 -0.0046024 0.0374549 0.0951593 0.05778 0.0458557 -0.0666044 0.1398087 0.0212495 0.0961553 -0.0062284 -0.0366787 0.0071897 -0.032051 0.0721556 0.0832757 0.0182894 -0.0482611 0.046414 0.0807267 0.0679892 -0.0826206 0.0039564 -0.0681154 0.2350984 0.0987799 0.0731925 0.1007444 0.3128679 -0.0358169 0.1219244 -0.0625746 0.2564912 unknown
polarizability: 65.8995212|-3.6885251|64.459409|3.102051|-3.9500111|74.5714237 unknown
InChI: InChI=1S/C5H9ClO2/c1-3-5(2,6)4(7)8/h7H,3H2,1-2H3
charge 0 multiplicity 1
17 atoms
Cl -0.905393 1.295983 -1.471542
O  1.539364 -0.809105 0.993251
O  1.521335 -0.498016 -1.306851
C  -0.245042 0.547824 0.154449
C  -1.353727 -0.354507 0.754417
C  0.1141 1.728154 1.07789
C  -1.74315 -1.575116 -0.101652
C  1.005146 -0.277223 -0.1985
H  -2.236857 0.287894 0.928934
H  -0.98656 -0.689661 1.744218
H  0.85594 2.393183 0.605604
H  0.532395 1.343107 2.024394
H  -0.793132 2.316326 1.295304
H  -2.549469 -2.143734 0.394744
H  -0.889014 -2.261858 -0.245943
H  -2.10238 -1.261942 -1.096924
H  2.345443 -1.34901 0.770807
