program: Gaussian 09
title: 000052514
version: EM64L-G09RevD.01
frameworkgroup: C1[X(C20H25N2O)]
method: RPBEPBE
basis: SDD
operation: Freq
keyword: #p
keyword: freq=noraman
keyword: PBEPBE/SDD
title: #p freq=noraman PBEPBE/SDD
converged: NO YES NO NO
title: Mulliken charges:
elementType: O N N C C C C C C C C C C C C C C C C C C C C H H H H H H H H H H H H H H H H H H H H H H H H H
charge: -0.459882 -0.115781 0.012089 -0.030058 -0.137135 -0.480604 -0.543745 -0.140601 -0.395635 -0.491273 -0.287162 -0.554485 -0.083582 0.360083 -0.581022 0.238796 -0.328583 -0.083287 -0.404147 -0.377557 -0.289444 -0.252645 -0.219613 0.306686 0.278480 0.279005 0.278582 0.276888 0.265858 0.247417 0.280435 0.276041 0.250964 0.266696 0.228055 0.290019 0.272921 0.243546 0.239530 0.380354 0.242785 0.231091 0.265206 0.205292 0.259144 0.281630 0.244079 0.254570
chargesum: 1.00000
title: Mulliken charges with hydrogens summed into heavy atoms:
elementType: O N N C C C C C C C C C C C C C C C C C C C C
charge: -0.079528 -0.115781 0.012089 0.276628 0.141345 0.076984 -0.000999 0.106816 0.160841 0.026387 -0.059107 0.252001 0.155948 0.360083 -0.107147 0.238796 -0.063377 -0.083287 -0.198856 -0.118412 -0.007814 -0.008567 0.034957
chargesum: 0.99999
polarizability: 2.46118114e+02 -1.39973038e+01 2.57584549e+02 -1.74056023e+01 -2.39140008e+01 1.62682434e+02
1716.lowfreq: -5.4626 -0.1692 -0.0768 -0.0108 0.6673 4.7479 22.1940 26.5833 49.8613
frequency: 21.6963 26.5420 49.8504 55.3936 67.2345 127.7883 141.9903 178.3653 178.9515 204.6869 215.0185 226.4820 242.8083 250.0289 267.8725 304.0596 333.8945 340.7933 348.6324 353.2948 371.3999 412.5345 418.1845 430.0537 453.6798 468.7011 491.1922 510.6676 514.4724 523.3953 537.7336 567.2903 589.1131 617.0091 652.0435 659.1641 692.1757 739.8026 767.1493 781.5883 800.3265 806.5042 810.0122 838.2614 841.6693 865.0416 866.3676 881.5722 888.6381 912.0679 934.3302 943.7188 956.4422 967.1840 972.4069 975.9677 978.7602 993.6706 995.6647 1002.1271 1007.4906 1024.6782 1028.2852 1044.3754 1058.8129 1076.5470 1093.5224 1104.3662 1109.6122 1133.2463 1145.9783 1155.7477 1162.4288 1178.0746 1180.9877 1205.0023 1217.3053 1219.5342 1235.2941 1246.9564 1251.8112 1255.3321 1264.6433 1286.0976 1289.8595 1300.1398 1304.4417 1306.5290 1323.1873 1332.3080 1336.1338 1344.9361 1351.0325 1354.3534 1365.2970 1371.7790 1377.6982 1384.5802 1428.4242 1435.1559 1443.3159 1452.0465 1453.0398 1459.1569 1475.4376 1479.3351 1483.2765 1495.6042 1506.4376 1549.1061 1579.9639 1619.0336 1658.0291 2974.1286 3005.7272 3018.1116 3026.2945 3027.5760 3028.7946 3032.3027 3034.8666 3070.5396 3076.3999 3077.3874 3087.4014 3098.0964 3099.3644 3105.2221 3120.0164 3134.5242 3145.7943 3150.0076 3156.7230 3164.5416 3169.3336 3182.1429 3207.7321 3565.7098
redmass: 4.4467 4.7867 4.4742 4.3017 2.7600 3.7715 3.3949 4.2523 4.6694 2.8321 2.4456 2.2788 2.8479 1.1421 3.0437 2.5230 1.9538 3.9717 1.4158 2.3137 3.0944 3.0160 3.7374 2.9552 2.9304 3.1831 4.3694 4.9957 5.6660 6.0670 3.5778 3.2834 3.9268 5.1875 2.8117 2.2955 3.4287 2.9470 1.5067 2.1780 2.6310 5.3865 2.5573 3.2017 2.6656 2.3288 1.4926 1.7418 2.2773 2.2681 2.3402 2.0088 4.1582 1.3912 1.4285 1.2807 1.9272 1.2612 1.9510 3.0446 1.3541 2.7493 2.1529 2.7059 3.1968 2.5709 2.1833 2.4737 1.8089 1.4093 1.4209 1.5565 1.6855 1.3364 1.2024 1.2613 1.4438 1.7807 1.7054 1.5274 1.9162 1.3042 1.3443 1.2598 1.2827 1.5367 1.3281 1.2633 1.3737 1.4050 1.4484 2.7740 1.3855 1.3898 1.3650 3.0285 1.3537 1.7858 2.6933 1.1998 1.1489 2.5186 1.0767 1.0605 1.0703 1.0791 1.0806 1.0854 3.6154 6.9257 6.4219 6.3110 4.6858 1.0831 1.0853 1.0606 1.0595 1.0570 1.0572 1.0440 1.0863 1.0910 1.0841 1.1016 1.1017 1.0983 1.0790 1.1078 1.0865 1.0888 1.1030 1.0902 1.0961 1.0938 1.1043 1.0996 1.1145 1.0664
irintensity: 0.5447 0.1611 0.3584 0.7769 0.2604 0.3325 2.0608 4.4180 5.6515 2.2890 2.1751 0.5317 1.4299 1.6421 7.3870 2.8266 58.4842 22.7435 55.7645 2.0105 0.1931 7.0705 3.4894 4.0766 4.8538 0.4188 4.9409 1.6796 5.0424 1.2201 0.6878 6.8806 1.3073 12.3955 8.1037 3.1853 2.7286 9.0140 48.8403 22.2457 6.6188 2.0715 41.0649 5.3046 6.3067 9.4811 20.4116 20.4797 6.4484 8.0720 11.2650 21.4743 17.5272 2.1990 1.2791 97.8290 2.9475 1.6536 28.6749 3.3319 0.1571 15.2150 22.4220 12.2803 6.2801 0.9160 3.5421 6.3160 4.8693 0.3482 7.0568 2.2005 0.4434 3.4741 1.2843 14.6462 7.4409 5.4992 12.6364 4.7680 3.6179 14.3005 20.5855 13.5089 4.4412 7.2103 8.2288 0.1584 10.1603 4.4711 3.4991 7.7548 4.5515 1.5464 6.2363 6.1362 0.7508 6.7184 11.6137 13.1327 10.2554 2.9760 26.1728 14.1448 20.1177 39.9186 38.5383 2.6454 27.0444 10.4805 7.5741 2.4998 6.4502 23.0683 13.4611 12.6566 3.6412 6.4485 9.9146 18.5893 4.0806 7.9184 16.3437 10.1218 5.6174 7.7054 3.1213 15.5542 22.6959 8.0429 7.8523 12.2493 8.8014 7.7892 2.0938 7.2040 9.2079 27.6173
temp: 298.150 k
press: 1.00000 atm
elementType: 8 7 7 6 6 6 6 6 6 6 6 6 6 6 6 6 6 6 6 6 6 6 6 1 1 1 1 1 1 1 1 1 1 1 1 1 1 1 1 1 1 1 1 1 1 1 1 1
symmnumber: 1
zpe: 1077045.7 jmol-1
zpe.correction: 0.410225 hartree
zpe.thermalcorrener: 0.430485 hartree
zpe.thermalcorrenthalpy: 0.431429 hartree
zpe.thermalcorrgfe: 0.361254 hartree
zpe.sumelectzpe: -959.895063 hartree
zpe.sumelectthermal: -959.874803 hartree
zpe.sumelectthermalent: -959.873859 hartree
zpe.sumelectthermalfe: -959.944034 hartree
dipole: 8.9051 -1.2611 -1.8346
dipole: 9.1791
quadrupole: -94.1624 -108.2458 -125.4248
quadrupole: -9.6049 3.7000 -1.8114
quadrupole: 15.1153 1.0319 -16.1471 -9.6049 3.7000 -1.8114
hfenergy: -960.3052883 hartree
pointgroup: C01 [X(C20H25N2O1)]
dipole: -3.5020827 -0.3110469 0.8249377 debye
polarizability: 246.3806501|13.7343528|259.243703|-19.3569786|18.0226099|160.7607435 unknown
InChI: InChI=1S/C20H25N2O/c1-3-14-13-22(2)11-9-15(14)12-19(22)20(23)17-8-10-21-18-7-5-4-6-16(17)18/h3-8,10,14-15,19-20,23H,1,9,11-13H2,2H3
charge 1 multiplicity 1
48 atoms
O  -0.195086 -2.454092 1.742977
N  -2.62182 -0.8961 0.651214
N  3.784525 -1.247652 -1.178877
C  -1.203116 -1.111653 0.001848
C  -2.393659 0.569161 -1.500754
C  -2.820801 0.602531 0.970322
C  -1.019103 0.002792 -1.07091
C  -2.985026 1.43229 -0.339457
C  -3.666677 -1.307901 -0.415783
C  -3.355411 -0.615389 -1.767256
C  -0.030895 -1.184573 1.01491
C  -2.870524 -1.721059 1.906454
C  -2.33465 2.795101 -0.193516
C  1.30846 -1.153465 0.272412
C  -3.007733 3.969995 -0.236525
C  2.175471 0.000575 0.275107
C  1.709052 -2.298995 -0.429258
C  3.417621 -0.105093 -0.477818
C  1.907878 1.229762 0.967403
C  2.949683 -2.301508 -1.139613
C  4.323065 1.0030 -0.51498
C  2.814484 2.292119 0.917955
C  4.028552 2.183072 0.168886
H  -1.275577 -2.109768 -0.468109
H  -2.28409 1.188332 -2.405583
H  -1.939826 0.923125 1.551817
H  -3.70619 0.681619 1.622552
H  -0.488501 -0.432134 -1.933936
H  -0.374667 0.812237 -0.68718
H  -4.06276 1.587253 -0.538726
H  -4.646818 -1.006964 -0.007965
H  -3.639243 -2.408144 -0.480872
H  -2.897028 -1.325437 -2.477806
H  -4.296881 -0.261802 -2.22121
H  -0.086447 -0.337016 1.72824
H  -2.598285 -2.767705 1.718238
H  -2.246545 -1.344006 2.72731
H  -3.938303 -1.629383 2.163684
H  -1.242105 2.807781 -0.054422
H  0.6554 -2.685625 2.195951
H  -2.489778 4.929788 -0.140141
H  -4.095312 4.012155 -0.376096
H  1.087463 -3.200322 -0.428153
H  0.997674 1.346134 1.567677
H  3.265928 -3.193112 -1.692582
H  5.243465 0.878366 -1.092578
H  2.600855 3.217294 1.463705
H  4.726083 3.026011 0.141139
