program: Gaussian 09
title: 000052426
version: EM64L-G09RevD.01
frameworkgroup: C1[X(C17H14O5)]
method: RPBEPBE
basis: SDD
operation: Freq
keyword: #pfreq=noraman
keyword: PBEPBE/SDD
title: #p freq=noraman PBEPBE/SDD
converged: YES YES NO NO
title: Mulliken charges:
elementType: O O O O O C C C C C C C C C C C C C C C C C H H H H H H H H H H H H H H
charge: -0.253213 -0.253212 -0.222186 -0.222172 -0.243011 0.307509 0.307526 0.349592 0.349618 -0.330850 -0.330847 -0.325781 -0.325793 -0.317602 -0.317618 -0.394698 -0.394702 0.124077 0.124061 -0.787371 -0.787366 0.252775 0.246956 0.246962 0.285749 0.285743 0.300944 0.300948 0.270005 0.270007 0.239230 0.239110 0.263637 0.239152 0.239184 0.263636
chargesum: 0.00000
title: Mulliken charges with hydrogens summed into heavy atoms:
elementType: O O O O O C C C C C C C C C C C C C C C C C
charge: -0.253213 -0.253212 -0.222186 -0.222172 -0.243011 0.307509 0.307526 0.349592 0.349618 -0.083894 -0.083885 -0.040032 -0.040050 -0.016658 -0.016670 -0.124693 -0.124694 0.124077 0.124061 -0.045394 -0.045395 0.252775
polarizability: 3.92088530e+02 5.29625010e-04 1.94151073e+02 1.27810368e-01 -2.57718458e-02 8.66940268e+01
1716.lowfreq: -2.5868 0.0005 0.0008 0.0010 2.7421 11.7096 16.8629 18.1453 41.8626
frequency: 16.8436 18.1446 41.8597 42.7844 52.5408 67.6922 68.6421 112.5183 127.2364 144.3416 144.5072 144.7212 165.6467 186.8368 245.7522 290.7609 298.4383 306.0651 348.4454 366.4951 403.4250 412.2017 412.6154 445.4935 475.6552 488.4159 491.1757 548.1788 583.1173 590.6206 591.6477 613.7040 625.4409 650.1119 665.3187 697.8007 716.4022 733.5407 734.7009 789.9945 808.7177 844.2703 845.9893 860.2577 862.0435 946.1401 946.7124 955.8013 977.4308 978.7146 999.0068 999.1422 1004.8373 1007.4584 1027.8449 1027.8561 1072.1967 1073.7086 1116.8616 1117.6627 1130.9371 1143.5849 1172.7475 1197.1017 1220.3672 1272.3714 1274.8536 1302.0826 1302.6346 1368.3005 1368.4388 1383.2263 1383.5358 1414.2053 1414.8533 1446.7075 1446.8496 1463.0167 1463.0218 1486.8963 1489.0644 1566.8085 1568.9873 1603.9055 1604.2378 1612.1689 1612.9891 1638.1638 2985.2732 2985.3100 3069.4332 3069.4880 3126.2705 3126.3091 3153.7437 3153.8221 3157.3842 3157.4109 3178.0006 3178.0429 3206.8034 3207.1048
redmass: 3.7303 8.9711 10.6457 6.5258 7.1106 4.0704 3.9443 7.8051 5.5990 1.4877 1.0368 2.4304 7.4136 5.2633 5.7639 6.2071 6.7076 5.8399 5.0934 8.1391 4.3981 2.9712 2.9748 3.9153 5.3342 3.2889 3.2825 5.7991 4.4738 2.4239 2.4185 7.3806 7.1489 5.0674 12.5081 9.4449 5.9368 3.6223 3.6413 6.6389 9.6581 1.2802 1.2717 1.4486 1.4626 2.2080 2.3382 7.3418 1.3238 1.3214 1.3569 1.3568 3.1471 2.9346 1.8215 1.8209 2.4830 2.3643 1.3787 1.2808 7.1101 2.7918 1.4646 1.3042 2.5082 3.9002 4.1856 1.2721 1.2662 1.3269 1.3286 5.2846 5.3408 3.6141 3.7214 1.0962 1.0934 1.0494 1.0494 2.4416 2.4924 7.1868 7.0902 7.9158 7.9790 6.6430 6.5877 11.2053 1.0377 1.0376 1.0969 1.0969 1.0991 1.0991 1.0904 1.0904 1.0890 1.0890 1.0970 1.0970 1.0943 1.0943
irintensity: 0.0004 0.5516 5.9203 0.1824 0.0002 0.0006 5.2917 2.1519 8.4416 0.0060 0.7955 0.0003 0.0500 3.3143 0.1236 0.6783 0.0004 4.0188 0.8940 25.5502 2.3422 0.0001 0.1217 3.4400 0.0106 0.0011 13.0500 30.8613 10.4156 0.0022 28.5743 2.8206 0.9760 13.1576 19.5701 0.0967 0.6854 0.0000 1.2682 37.3697 4.1397 0.0013 31.0842 0.0086 146.8452 136.2367 8.6183 8.5608 0.0002 1.8618 0.0006 1.8823 63.8503 0.1611 0.0141 2.4483 36.8946 2.3980 130.7319 32.3805 3077.4504 159.2268 0.0186 79.7666 3.8674 415.7630 53.5487 0.0001 0.1798 21.0381 79.0139 10.1738 0.0156 73.7889 45.0190 57.2832 7.1594 2.1923 40.6529 85.6274 0.2126 300.3951 16.0736 93.9995 149.2833 7.6303 60.4403 167.5202 3.2452 3.4065 11.0930 12.6847 31.8978 4.6162 3.4017 12.4881 0.0274 0.0371 4.6594 2.1487 6.2457 0.5266
temp: 298.150 k
press: 1.00000 atm
elementType: 8 8 8 8 8 6 6 6 6 6 6 6 6 6 6 6 6 6 6 6 6 6 1 1 1 1 1 1 1 1 1 1 1 1 1 1
symmnumber: 1
zpe: 702440.9 jmol-1
zpe.correction: 0.267546 hartree
zpe.thermalcorrener: 0.288065 hartree
zpe.thermalcorrenthalpy: 0.289009 hartree
zpe.thermalcorrgfe: 0.214840 hartree
zpe.sumelectzpe: -1030.769383 hartree
zpe.sumelectthermal: -1030.748864 hartree
zpe.sumelectthermalent: -1030.747920 hartree
zpe.sumelectthermalfe: -1030.822089 hartree
dipole: -0.0001 4.0064 0.0049
dipole: 4.0064
quadrupole: -167.9390 -115.4462 -129.2400
quadrupole: 0.0024 -0.3013 -0.0109
quadrupole: -30.3973 22.0955 8.3018 0.0024 -0.3013 -0.0109
hfenergy: -1031.0369288 hartree
pointgroup: C01 [X(C17H14O5)]
dipole: 0.0019295 -1.5761221 0.018119 debye
polarizability: 391.4039199|0.078947|194.1402749|-14.4426524|-1.0866812|87.3894353 unknown
InChI: InChI=1S/C17H14O5/c1-11(18)13-3-7-15(8-4-13)21-17(20)22-16-9-5-14(6-10-16)12(2)19/h3-10H,1-2H3
charge 0 multiplicity 1
36 atoms
O  -1.094859 1.027841 0.040637
O  1.088775 1.029275 -0.066893
O  -7.503358 0.758752 0.350146
O  7.497891 0.768351 -0.372445
O  -0.000667 -1.070864 0.007797
C  -5.212387 0.028968 0.241699
C  5.208566 0.035893 -0.247911
C  -2.451295 0.581704 0.108193
C  2.446241 0.585014 -0.125632
C  -4.262754 -1.023646 0.198228
C  4.261237 -1.017787 -0.184337
C  -4.746059 1.373303 0.216528
C  4.739258 1.379411 -0.249048
C  -2.876529 -0.765888 0.131193
C  2.874439 -0.761828 -0.122691
C  -3.373235 1.653511 0.150161
C  3.365796 1.657844 -0.188244
C  -6.694743 -0.215055 0.314111
C  6.691496 -0.20625 -0.314838
C  -7.205584 -1.651664 0.3438
C  7.205617 -1.642008 -0.311752
C  -0.002058 0.174825 -0.004646
H  -4.594886 -2.06664 0.216238
H  4.595649 -2.060201 -0.182151
H  -5.487042 2.178169 0.250603
H  5.478469 2.185102 -0.298685
H  -2.154919 -1.582423 0.098508
H  2.154647 -1.579204 -0.074527
H  -2.993988 2.678951 0.129879
H  2.984324 2.682658 -0.187881
H  -6.807808 -2.197851 1.219488
H  -6.893136 -2.204251 -0.561933
H  -8.304505 -1.639991 0.396439
H  6.809506 -2.208899 -1.174947
H  6.893869 -2.174442 0.606197
H  8.304533 -1.629081 -0.364182
