program: Gaussian 09
title: 000052373
version: EM64L-G09RevD.01
frameworkgroup: C1[X(C11H11NO)]
method: RPBEPBE
basis: SDD
operation: Freq
keyword: #p
keyword: freq=noraman
keyword: PBEPBE/SDD
title: #p freq=noraman PBEPBE/SDD
converged: NO YES NO NO
title: Mulliken charges:
elementType: O N C C C C C C C C C C C H H H H H H H H H H H
charge: -0.235976 -0.235831 0.247727 0.257777 -0.166481 -0.415866 0.222111 -0.491756 -0.309401 -0.401337 -0.221902 -0.238089 -0.676857 0.260643 0.257655 0.239163 0.238937 0.298088 0.241387 0.226196 0.225110 0.212182 0.233483 0.233037
chargesum: 0.00000
title: Mulliken charges with hydrogens summed into heavy atoms:
elementType: O N C C C C C C C C C C C
charge: -0.235976 -0.235831 0.247727 0.257777 0.094162 -0.158211 0.222111 -0.013657 -0.011314 -0.159949 0.004294 -0.012979 0.001846
polarizability: 1.87275094e+02 4.79281674e+00 1.37716674e+02 -2.90805116e-02 -6.11864604e-03 5.96107076e+01
1716.lowfreq: -14.2389 -4.6529 0.0007 0.0009 0.0010 10.6744 51.4109 93.4228 109.5539
frequency: 51.2589 93.3467 109.5534 139.9492 184.9501 224.7103 267.5207 272.5044 319.8119 400.2643 425.6274 496.6910 526.5363 572.1138 581.6679 612.0230 614.0924 705.1182 731.0623 758.9618 764.3381 781.8726 812.8354 867.8443 872.9631 887.1143 898.1080 956.6401 989.8411 1009.0413 1014.4759 1074.7331 1079.9774 1080.1922 1109.8506 1143.6432 1167.9639 1206.2297 1223.4299 1256.6610 1286.9943 1294.1784 1337.4666 1359.7588 1399.4809 1412.3278 1444.5482 1450.6718 1463.9004 1467.6110 1478.6948 1533.3796 1589.0393 1615.1067 1625.6295 2975.7774 3001.5916 3025.3808 3098.5924 3108.2126 3129.1208 3142.9091 3161.4304 3202.8734 3212.2693 3251.0297
redmass: 4.4186 1.6191 5.0488 3.9088 1.2761 3.8246 4.8429 4.2085 3.8407 6.4230 2.9522 4.9429 2.6996 6.4292 3.2535 3.5070 5.8741 4.0229 1.4723 5.4456 1.3782 2.3654 1.3668 5.0129 1.3138 1.4643 4.7291 1.3792 1.3017 1.5938 2.1283 1.5160 2.6601 1.6095 1.9713 1.6587 1.1499 2.3869 2.1357 1.1707 1.9371 2.4672 2.2230 2.5571 1.2150 4.9898 2.3031 1.2095 2.9543 1.0383 1.0533 5.1251 6.9477 7.6488 8.7294 1.0599 1.0364 1.0994 1.1003 1.1003 1.0857 1.0918 1.0986 1.0953 1.0926 1.1042
irintensity: 1.6947 2.5396 0.6467 1.0168 1.6518 4.3214 3.3610 0.0104 11.6590 0.6595 9.9447 4.1107 0.1316 5.5881 0.8737 1.0739 3.4253 2.7637 34.4931 6.7771 79.1553 53.0275 6.8887 0.2086 2.8187 5.4025 71.8349 6.6569 0.6953 3.5271 10.5445 27.8610 0.4615 0.2234 8.0424 4.6480 9.3754 144.7666 46.9881 0.0390 4.7306 134.4054 94.3202 98.8522 29.5226 9.0914 99.6565 47.6552 9.5420 12.4908 15.7682 37.5508 29.7330 55.0908 78.5243 20.8531 30.1625 8.9931 26.7126 27.8539 1.2028 19.1964 31.3490 3.3587 2.9897 1.0462
temp: 298.150 k
press: 1.00000 atm
elementType: 8 7 6 6 6 6 6 6 6 6 6 6 6 1 1 1 1 1 1 1 1 1 1 1
symmnumber: 1
zpe: 504545.9 jmol-1
zpe.correction: 0.192171 hartree
zpe.thermalcorrener: 0.203285 hartree
zpe.thermalcorrenthalpy: 0.204229 hartree
zpe.thermalcorrgfe: 0.154966 hartree
zpe.sumelectzpe: -554.835499 hartree
zpe.sumelectthermal: -554.824386 hartree
zpe.sumelectthermalent: -554.823442 hartree
zpe.sumelectthermalfe: -554.872704 hartree
dipole: 0.6558 2.8960 0.0051
dipole: 2.9693
quadrupole: -65.3644 -72.6715 -80.2787
quadrupole: 6.0554 0.0062 -0.0283
quadrupole: 7.4071 0.1000 -7.5071 6.0554 0.0062 -0.0283
hfenergy: -555.0276705 hartree
pointgroup: C01 [X(C11H11N1O1)]
dipole: 0.2676197 -1.1371615 0.0002473 debye
dipolederiv: -0.6967837 -0.0028559 0.0007143 -0.6734594 -0.9161079 0.0009055 -0.00025 -0.0006935 -0.3078389 -1.6739441 -0.364152 0.0016215 -0.6860304 -0.6238207 0.0011553 0.0029509 0.0011942 -0.0494693 0.6709065 -0.093927 -0.0002209 -0.1913304 -0.1522587 0.0005059 -0.0009677 0.0001576 0.024325 0.0483126 -0.0364138 0.0001652 -0.4346297 -0.061404 0.0004245 0.0011254 0.0004037 0.0238935 0.0459708 0.3102564 -0.0008009 0.5930526 0.3512427 -0.0020581 -0.0004867 -0.0017168 -0.1578521 -0.311046 -0.1983402 0.0002688 0.0203004 0.1046723 -0.000917 0.0000682 -0.0005198 -0.225074 1.9934855 0.3153878 -0.001576 0.9232543 1.0919994 -0.0005246 0.0000772 0.0001286 0.1643937 -0.2075729 0.0943188 -0.0000179 0.2389446 -0.0721719 0.0006095 -0.0031583 0.0011236 0.1455778 -0.1716773 0.0001386 0.000025 0.0964821 0.0398287 -0.0004904 -0.0000797 -0.0002736 -0.1398469 -0.0283347 0.0064889 -0.000204 0.1765487 0.1048016 -0.0008024 -0.0005445 -0.0007447 -0.174317 0.0505164 0.0466036 -0.0002852 0.0383459 0.1130453 -0.0007679 -0.0002528 -0.0006657 -0.1833428 0.0818209 -0.0372427 -0.0001528 -0.0995154 -0.138014 -0.0000627 0.0000282 -0.0000529 -0.1640695 0.0178508 -0.0568484 0.0003526 -0.0234431 0.0473154 -0.0001068 0.0006202 -0.0003249 0.0599891 0.0144609 0.0777854 -0.0001642 0.0503478 0.083431 0.0002848 -0.0003078 0.0002876 0.1908901 0.0764725 -0.0537257 0.0002409 -0.0092826 -0.0444899 0.0006597 -0.0000195 0.0006151 0.1854922 0.0220459 -0.0330235 0.0396063 -0.0162243 0.0048151 0.0982259 0.0369171 0.1068468 -0.026546 0.0223967 -0.0342274 -0.0395518 -0.0175848 0.0020334 -0.0988056 -0.0362235 -0.1073229 -0.0237515 0.0924952 -0.0756868 0.0002597 -0.0322892 0.062264 0.0003652 0.0001111 0.0002471 0.1787594 0.0003579 -0.074906 0.0003388 -0.1141019 -0.0326193 0.0006199 0.0004233 0.0005852 0.1634937 0.0508723 0.0683323 -0.000092 0.0832458 -0.0971581 0.0006041 -0.0001154 0.0005664 0.1608172 -0.1447148 0.0452165 0.0001647 0.0468859 0.0825672 0.0001715 0.000154 0.0001592 0.162805 -0.1536415 0.0818751 0.0000498 0.1465782 0.0108091 0.0003612 -0.0001943 0.0005077 0.1056078 0.1004212 0.0074771 0.0221254 -0.0583747 0.0185718 -0.1031457 -0.0126457 -0.099519 -0.0554392 0.0993289 0.0074686 -0.0228672 -0.0577204 0.0206476 0.1027882 0.0127703 0.0990109 -0.0584974 unknown
polarizability: 187.3523533|-4.3742498|137.6389345|-0.0991811|-0.1754004|59.6111881 unknown
InChI: InChI=1S/C11H11NO/c1-2-11(13)12-8-7-9-5-3-4-6-10(9)12/h3-8H,2H2,1H3
charge 0 multiplicity 1
24 atoms
O  1.869313 1.641911 -0.001574
N  0.693763 -0.372218 -0.001898
C  -0.632165 0.163279 -0.001567
C  -1.540488 -0.948739 0.002293
C  0.589474 -1.793851 0.002294
C  -0.740157 -2.165251 0.004706
C  1.898129 0.382565 -0.003494
C  3.199946 -0.424875 -0.003403
C  -1.083242 1.499429 -0.00468
C  -2.93663 -0.713284 0.00293
C  -2.481253 1.707721 -0.003959
C  -3.397456 0.619644 -0.000204
C  4.441851 0.483188 -0.011776
H  1.478248 -2.418915 0.003802
H  -1.112911 -3.188625 0.007967
H  3.210986 -1.085068 0.887353
H  3.206368 -1.096268 -0.885428
H  -0.376267 2.329923 -0.00722
H  -3.642904 -1.550687 0.005761
H  -2.865595 2.733796 -0.006272
H  -4.473785 0.824437 0.000265
H  5.361821 -0.127988 -0.010133
H  4.452977 1.142803 0.871959
H  4.449276 1.131973 -0.90362
