program: Gaussian 09
title: 000052379
version: EM64L-G09RevD.01
frameworkgroup: C1[X(C10H6Cl2O5)]
method: RPBEPBE
basis: SDD
operation: Freq
keyword: #p
keyword: freq=noraman
keyword: PBEPBE/SDD
title: #p freq=noraman PBEPBE/SDD
converged: YES YES NO NO
title: Mulliken charges:
elementType: Cl Cl O O O O O C C C C C C C C C C H H H H H H
charge: -0.039541 0.006798 -0.368852 -0.410731 -0.387036 -0.248090 -0.261130 0.524148 -0.407025 -0.352813 -0.327617 -0.290456 -0.293989 0.472143 0.129097 0.132226 0.110371 0.267999 0.335701 0.266202 0.371060 0.386665 0.384868
chargesum: 0.00000
title: Mulliken charges with hydrogens summed into heavy atoms:
elementType: Cl Cl O O O O O C C C C C C C C C C
charge: -0.039541 0.006798 0.002208 -0.024066 -0.002168 -0.248090 -0.261130 0.524148 -0.139026 -0.017112 -0.061414 -0.290456 -0.293989 0.472143 0.129097 0.132226 0.110371
polarizability: 2.74196524e+02 -2.46350335e+00 1.70812450e+02 -4.75334327e-01 -1.91140296e+00 6.34445494e+01
1716.lowfreq: -2.5612 -0.0015 -0.0015 0.0013 0.8557 5.2040 27.1457 39.9222 65.8463
frequency: 27.1114 39.9188 65.8461 72.8996 100.1144 108.4211 158.0871 172.3539 188.9501 198.6109 214.9856 263.3954 279.1209 287.9389 354.9185 377.2640 401.1765 403.0374 456.2405 481.8359 502.3158 515.7370 532.5181 570.6208 588.6755 605.0078 613.1928 643.4794 696.4468 726.5837 739.4703 755.1311 771.8193 799.8763 886.7208 917.5797 933.1489 978.7552 1009.3935 1055.6819 1068.9002 1102.5120 1149.1036 1223.8209 1254.8016 1279.2704 1305.3808 1330.4364 1361.4966 1409.9209 1421.1287 1479.7972 1548.4749 1586.0850 1607.1896 1627.0981 1644.0313 3087.5843 3158.4983 3160.5871 3473.0045 3512.2276 3526.9249
redmass: 10.8788 10.3052 8.5776 10.3030 12.8613 12.3781 14.5821 11.7763 8.0180 8.8834 5.0865 8.8418 7.2565 6.5943 17.8478 5.5283 6.8499 6.7470 3.8425 1.6044 2.1027 3.8988 4.6914 1.7520 3.6482 1.6465 2.5572 5.1921 5.3426 5.0066 7.0735 8.0371 7.2893 6.7475 1.4513 8.0904 1.3238 1.5358 6.5805 3.5012 2.6170 2.0140 1.5576 1.8890 1.5809 2.0790 2.0895 3.5116 3.2937 2.3728 3.5098 3.6209 5.8436 7.9919 8.2793 8.4643 8.0073 1.0872 1.0925 1.0946 1.0647 1.0640 1.0642
irintensity: 0.2258 1.5077 0.0668 0.8640 0.0179 0.1476 0.1075 0.8859 1.7593 0.1234 0.4715 3.6172 3.5951 10.1103 0.6815 7.3141 3.7323 9.8407 11.5101 75.5101 62.6092 38.0606 18.0203 134.0353 49.0326 211.3497 16.2885 4.2731 24.8413 11.6960 31.1513 26.2413 45.5380 5.1310 11.0194 6.7843 21.4744 23.9121 107.8589 2.6146 847.1214 196.5931 166.5144 36.0099 113.7811 21.2913 46.1683 36.7097 79.9459 112.7863 85.4069 147.9473 61.2100 296.1869 240.6987 190.9506 126.8543 0.0727 3.4020 44.9725 126.6530 48.3818 68.2362
temp: 298.150 k
press: 1.00000 atm
elementType: 17 17 8 8 8 8 8 6 6 6 6 6 6 6 6 6 6 1 1 1 1 1 1
symmnumber: 1
zpe: 375703.1 jmol-1
zpe.correction: 0.143098 hartree
zpe.thermalcorrener: 0.159215 hartree
zpe.thermalcorrenthalpy: 0.160159 hartree
zpe.thermalcorrgfe: 0.097593 hartree
zpe.sumelectzpe: -1679.678076 hartree
zpe.sumelectthermal: -1679.661959 hartree
zpe.sumelectthermalent: -1679.661015 hartree
zpe.sumelectthermalfe: -1679.723580 hartree
dipole: 0.7237 1.7237 0.4608
dipole: 1.9254
quadrupole: -100.5237 -113.2861 -111.5729
quadrupole: -2.4195 1.3929 5.6103
quadrupole: 7.9372 -4.8252 -3.1120 -2.4195 1.3929 5.6103
hfenergy: -1679.8211734 hartree
pointgroup: C01 [X(C10H6Cl2O5)]
dipole: -0.1970122 -0.5187526 0.5156847 debye
dipolederiv: -0.3216711 0.2074275 -0.106847 0.2879301 -0.4955664 0.2189241 -0.1572822 0.2170537 -0.1433964 -0.3033619 -0.2588454 0.1154017 -0.3613653 -0.4488556 0.193863 0.1624864 0.1926759 -0.1123359 -1.7732236 0.1392937 -0.1120713 0.1971428 -0.1678984 -0.0835452 -0.1920936 -0.083795 -0.3251161 -1.3101782 -0.4618674 0.097117 -0.5957796 -0.5819992 -0.0070833 0.0495496 -0.0174374 -0.3622484 -0.7754801 0.0109105 0.3899042 0.004992 -0.2488875 -0.146602 0.7499249 -0.088778 -0.9720007 -0.8595918 0.1423701 -0.1551981 0.3026115 -0.8250316 0.2589057 -0.370412 0.2828242 -0.4762954 -0.5001711 0.1957651 0.170132 0.1301277 -0.8215257 -0.031639 0.2818447 0.1712951 -0.559611 -0.8441021 0.0224152 -0.0177384 0.0674319 0.0107999 -0.0121413 -0.1893594 -0.0187565 -0.0048037 0.2439122 -0.0855486 0.0504293 0.058927 -0.1008698 0.0050937 -0.105125 0.003184 -0.0925748 0.1247171 0.0006125 0.0246027 -0.1279616 -0.1875789 0.0763267 0.1562103 0.0750776 -0.0817446 1.5388128 0.1391951 -0.105044 0.2352516 -0.0286071 -0.0117621 -0.10294 -0.0590005 0.0125879 -0.1415433 -0.3083209 0.1468358 -0.8556366 0.6839394 -0.3643531 0.388139 -0.3691652 0.0815287 0.1058516 0.4064176 -0.182543 0.9755322 0.6632845 -0.3335158 -0.440473 -0.3380116 0.069132 1.4663593 -0.127867 0.1212807 -0.1086086 -0.1889073 0.1372126 0.1588468 0.1471909 0.0753551 -1.5244595 -0.015796 0.0095126 -0.3194618 -0.2826216 0.173374 0.2200023 0.1369115 -0.2266887 2.4534877 0.1597342 0.2455857 -0.1172816 1.1145334 -0.3804285 0.6526294 -0.3414945 0.4194848 0.7804056 -0.3280966 -0.5700071 -0.0271983 1.0555847 -0.1157921 -1.1804896 -0.2785321 1.3172202 0.0815233 0.0552161 -0.0358008 0.0345088 0.0506252 0.0542044 -0.0216431 0.0577319 0.1282547 0.2592198 0.0018176 -0.045942 0.0440358 0.1160162 0.012405 -0.0364689 0.0253079 0.1602165 0.1191853 -0.0135418 0.0093412 0.0520208 0.058717 0.0603481 0.0416895 0.0731163 0.0674412 0.5119395 -0.0272596 0.0162954 -0.0704709 0.2310461 0.0710469 0.0459973 0.067744 0.3422779 0.3386669 0.0689634 -0.0557828 0.1652832 0.2449119 0.1046465 -0.0377397 0.0951556 0.3290647 0.3297016 0.0770048 -0.0094638 0.027969 0.1488907 0.1205118 -0.073294 0.0497023 0.354252 unknown
polarizability: 273.189162|8.7586463|145.7024213|-5.725667|-46.3890339|89.5619402 unknown
InChI: InChI=1S/C10H6Cl2O5/c11-6-2-4(3-7(12)8(6)13)1-5(9(14)15)10(16)17/h1-3,13-14,16H
charge 0 multiplicity 1
23 atoms
Cl 3.186256 -2.33244 1.018723
Cl 3.610582 2.668404 -1.336559
O  4.58504 0.151579 -0.04511
O  -4.562075 -0.480018 -0.322026
O  -3.074034 -0.853294 2.037283
O  -3.694509 1.495561 -1.178608
O  -1.533602 -2.224394 0.987905
C  0.349782 0.32078 -0.391513
C  1.190291 1.375538 -0.868517
C  0.968478 -0.829204 0.189288
C  -1.087554 0.512545 -0.575905
C  2.358641 -0.866564 0.295685
C  2.581415 1.310459 -0.737542
C  3.210023 0.183389 -0.147441
C  -2.210202 -0.094237 -0.049456
C  -3.520174 0.421158 -0.553084
C  -2.218812 -1.170983 0.983195
H  0.741728 2.260417 -1.33141
H  0.363523 -1.681091 0.509725
H  -1.342781 1.34518 -1.250168
H  4.879692 -0.700871 0.378181
H  -5.40778 -0.097976 -0.680727
H  -3.087928 -1.60884 2.686182
