program: Gaussian 09
title: 000052378
version: EM64L-G09RevD.01
frameworkgroup: C1[X(C10H7BrO5)]
method: RPBEPBE
basis: SDD
operation: Freq
keyword: #p
keyword: freq=noraman
keyword: PBEPBE/SDD
title: #p freq=noraman PBEPBE/SDD
converged: YES YES NO NO
title: Mulliken charges:
elementType: Br O O O O O C C C C C C C C C C H H H H H H H
charge: 0.053524 -0.397535 -0.412542 -0.388286 -0.253498 -0.255078 0.483751 -0.298423 -0.383336 -0.333071 -0.416724 -0.385761 0.419876 0.134120 0.129486 0.104267 0.324541 0.243608 0.261194 0.233081 0.368916 0.384664 0.383226
chargesum: 0.00000
title: Mulliken charges with hydrogens summed into heavy atoms:
elementType: Br O O O O O C C C C C C C C C C
charge: 0.053524 -0.028620 -0.027877 -0.005060 -0.253498 -0.255078 0.483751 0.026118 -0.139728 -0.071877 -0.416724 -0.152680 0.419876 0.134120 0.129486 0.104267
polarizability: 2.66990132e+02 1.10239245e+01 1.64560942e+02 2.83305199e+00 4.00379993e+00 6.23445765e+01
1716.lowfreq: -5.0580 -2.3352 0.0003 0.0006 0.0007 2.9782 28.1578 34.0976 64.6246
frequency: 28.1535 34.0905 64.6239 71.0212 97.8824 137.9680 159.0332 182.4871 188.4401 214.6777 268.1164 278.6518 314.3735 384.2894 392.3169 402.1404 440.8684 452.3163 469.3867 513.5258 550.1518 574.4545 590.5669 606.5934 627.1102 662.9721 694.8692 729.8195 749.6305 766.5013 794.4571 807.1677 879.4464 932.3834 950.3111 982.2746 1004.7245 1027.8529 1066.4770 1101.8663 1117.7763 1169.8698 1224.3241 1270.5914 1278.7654 1305.6564 1322.5860 1373.3794 1410.0308 1421.2006 1488.3544 1554.0788 1591.4846 1611.8356 1628.7912 1642.9318 3084.1185 3122.5524 3149.4847 3165.2284 3510.2634 3528.4899 3571.8650
redmass: 9.4625 10.3674 8.0144 9.9803 13.0408 5.4563 11.3177 6.7285 6.4092 9.4620 5.6710 8.4794 7.6367 2.4690 1.4532 7.0374 3.3812 4.1133 3.7145 4.5396 2.2960 2.4585 2.3959 1.5203 4.0951 7.2118 5.0631 3.9645 7.0323 6.7787 6.1212 1.5143 7.1849 1.3641 1.3537 1.5333 6.8037 3.3106 2.6377 1.9688 1.5474 1.2027 2.0139 2.0723 2.2390 1.4183 3.0372 4.1104 3.1569 2.3896 2.8008 6.0686 7.4168 7.2763 8.4092 7.9569 1.0871 1.0882 1.0967 1.0938 1.0640 1.0642 1.0661
irintensity: 1.3420 1.7503 0.3829 0.4213 0.0128 2.6272 1.3704 0.8518 0.7376 2.6967 7.1026 2.1388 5.2713 44.2569 98.2483 8.7567 0.7337 14.9517 12.5583 56.0637 18.8673 92.1656 88.1458 149.4958 35.8037 20.1466 23.1905 4.7292 14.2615 22.2198 4.1237 46.3995 47.8036 3.9956 15.9318 17.8626 120.0156 30.6688 724.5667 79.9789 355.7175 25.1725 71.8970 79.6345 58.0325 32.3958 95.6264 41.1775 15.4235 29.4469 182.5931 34.0799 542.2818 115.3943 188.4331 126.6014 0.1716 10.5498 8.0281 32.8594 42.6134 67.1014 96.5271
temp: 298.150 k
press: 1.00000 atm
elementType: 35 8 8 8 8 8 6 6 6 6 6 6 6 6 6 6 1 1 1 1 1 1 1
symmnumber: 1
zpe: 399179.8 jmol-1
zpe.correction: 0.152040 hartree
zpe.thermalcorrener: 0.167186 hartree
zpe.thermalcorrenthalpy: 0.168130 hartree
zpe.thermalcorrgfe: 0.107337 hartree
zpe.sumelectzpe: -773.688746 hartree
zpe.sumelectthermal: -773.673599 hartree
zpe.sumelectthermalent: -773.672655 hartree
zpe.sumelectthermalfe: -773.733448 hartree
dipole: 0.7887 2.9111 1.0972
dipole: 3.2094
quadrupole: -93.5027 -86.3565 -103.1469
quadrupole: 21.0857 2.6616 -2.6819
quadrupole: 0.8327 7.9789 -8.8115 21.0857 2.6616 -2.6819
hfenergy: -773.8407851 hartree
pointgroup: C01 [X(C10H7Br1O5)]
dipole: -0.4404156 -0.9244401 0.7388097 debye
dipolederiv: -0.1986884 0.2118383 -0.069117 0.373884 -0.3899811 0.1260156 -0.1273768 0.1444646 -0.0475876 -1.8483387 -0.1601368 0.2384319 -0.0008264 -0.0603193 -0.1355451 0.2277654 -0.1094779 -0.3700254 -1.2237785 -0.3863971 0.316399 -0.4930581 -0.4898856 0.1533322 0.45251 0.1524967 -0.5436991 -0.761834 -0.2958369 -0.2497794 -0.5761866 -0.5527435 -0.3246324 -0.469943 -0.38793 -0.6536194 -0.8999766 0.2532991 0.0255756 0.5234226 -0.9108222 0.1616169 0.0503527 0.1654431 -0.397921 -0.5146719 0.0309871 -0.2848522 -0.1026692 -0.7231233 0.2389427 -0.2844167 0.0229684 -0.6097506 -0.9014418 -0.0012669 0.0828026 0.1205413 -0.033252 0.0024298 0.1783985 0.0194575 -0.0297615 0.1843744 0.1025662 -0.0863143 -0.1388877 -0.2051298 0.073275 -0.0610382 0.0526072 -0.0458062 0.4025511 0.0629262 -0.0862404 0.2651117 0.058155 -0.0976287 -0.08434 -0.087793 -0.0776578 1.5595986 0.1899478 -0.1718592 0.3524502 0.0542919 -0.0445572 -0.2790806 0.0176451 -0.0221192 -0.130759 -0.5260411 0.217815 -1.0622055 0.6654809 -0.2541854 0.4576029 -0.2912826 -0.0770446 -0.4808534 -0.0927879 0.0646864 0.4734593 -0.0156759 -0.1224169 -0.17027 -0.0582191 -0.1429513 1.6183042 0.313401 -0.3267025 0.0830143 -0.0579433 0.0820811 -0.280946 0.0392962 0.1522047 -1.5466852 -0.0052489 0.1213832 -0.4193 -0.4058069 0.0620825 0.2233029 0.0637367 -0.1286973 2.4667051 -0.1043052 -0.4156336 -0.5413267 1.1083191 -0.3169402 -0.4902614 -0.3920792 0.4805735 0.7977668 0.1627807 0.6437558 0.8156609 1.3937249 -0.0015771 0.8014273 0.1988217 0.9109569 0.2351293 0.0157584 0.0270547 0.0538793 0.0998515 0.0290868 -0.016221 0.019392 0.1387176 0.0498807 0.0986577 -0.0209175 0.0596726 -0.0023575 0.054174 -0.0106377 0.04927 0.1345334 0.1079186 -0.0094921 0.0050735 0.0135295 -0.0133246 0.0184308 -0.0667961 0.0068541 0.1341657 -0.0357187 -0.0748235 0.0587615 -0.062521 -0.0045732 0.0822753 0.0517159 0.0843542 0.1342436 0.4861041 0.0504043 -0.028884 0.0307267 0.1121025 0.1123047 -0.0294921 0.1055781 0.3487115 0.3167577 0.0941759 -0.0085186 0.1537173 0.1989911 0.0316682 -0.091066 0.0445395 0.3904905 0.3176554 0.0695937 -0.0529207 0.0779118 0.1740212 0.0697673 0.0188099 0.1398566 0.3220436 unknown
polarizability: 267.1816538|-7.0639075|154.0312786|-12.4034519|-29.496696|72.6827179 unknown
InChI: InChI=1S/C10H7BrO5/c11-7-4-5(1-2-8(7)12)3-6(9(13)14)10(15)16/h1-4,12-13,15H
charge 0 multiplicity 1
23 atoms
Br -3.557096 2.219864 -0.584771
O  -4.705745 -0.322298 0.689238
O  4.32034 0.207338 -0.765656
O  2.811042 2.126936 0.66199
O  3.62302 -1.81193 0.142456
O  1.189157 2.173682 -0.98845
C  -0.496295 -0.630902 0.199168
C  -1.213467 0.542227 -0.196919
C  -1.244215 -1.722762 0.737769
C  0.946292 -0.827857 0.078846
C  -2.601613 0.617147 -0.023944
C  -2.632263 -1.640309 0.917771
C  -3.330895 -0.463436 0.542129
C  2.01707 0.020411 -0.123334
C  3.358044 -0.630972 -0.194607
C  1.94311 1.506586 -0.237669
H  -0.683554 1.371349 -0.672141
H  -0.718902 -2.638245 1.03229
H  1.265615 -1.872835 0.219686
H  -3.184359 -2.486495 1.345391
H  -5.112928 -1.135142 1.081767
H  5.190599 -0.273617 -0.796262
H  2.766142 3.113059 0.52835
