program: Gaussian 09
title: 000052366
version: EM64L-G09RevD.01
frameworkgroup: C1[X(C10H13NO2)]
method: RPBEPBE
basis: SDD
operation: Freq
keyword: #p
keyword: freq=noraman
keyword: PBEPBE/SDD
title: #p freq=noraman PBEPBE/SDD
converged: YES YES NO NO
title: Mulliken charges:
elementType: O O N C C C C C C C C C C H H H H H H H H H H H H H
charge: -0.315017 -0.288486 -0.617677 -0.158993 -0.405911 0.517908 -0.694586 -0.427076 -0.378687 -0.223306 -0.237955 -0.240367 0.305770 0.242454 0.210432 0.216595 0.211480 0.216631 0.234415 0.248436 0.234008 0.226739 0.223332 0.227998 0.333393 0.338469
chargesum: 0.00000
title: Mulliken charges with hydrogens summed into heavy atoms:
elementType: O O N C C C C C C C C C C
charge: -0.315017 -0.288486 0.054185 0.083460 0.021115 0.517908 -0.032059 -0.178640 -0.144679 0.003433 -0.014623 -0.012369 0.305770
polarizability: 1.40873800e+02 -6.42389741e+00 9.81685906e+01 -7.50756979e-01 1.02878054e+01 1.10894212e+02
1716.lowfreq: -15.4099 -4.8924 -0.0010 -0.0007 -0.0006 3.8919 21.5479 43.0523 60.6250
frequency: 21.4429 42.9947 60.6227 81.5423 111.0056 156.1777 207.7901 219.5569 259.6518 311.8440 315.9269 402.4093 410.3650 483.3811 484.2797 513.5990 538.1990 610.1609 618.3266 618.7459 701.2571 704.8815 736.0451 771.0032 822.3245 843.6692 853.3866 914.0280 934.9310 953.7211 976.5412 991.1209 997.0164 1026.5958 1052.0945 1054.2681 1074.9929 1086.5261 1140.6760 1172.5603 1187.5703 1214.5304 1254.8816 1277.6981 1289.5057 1325.7367 1339.4051 1361.2951 1387.0104 1390.0099 1445.2685 1454.6134 1475.0616 1483.7464 1487.1883 1585.1507 1594.9888 1614.2561 1680.4161 2983.0500 2990.9409 3022.9638 3046.5245 3077.0269 3092.6597 3121.2483 3127.9235 3138.6732 3148.5387 3163.7021 3558.5288 3717.2924
redmass: 3.8205 7.0533 5.0545 2.2272 3.6618 2.1241 3.0453 2.8430 1.8540 5.1183 3.7371 2.7921 3.2871 2.0875 1.4178 1.0517 3.2720 5.4266 6.3646 5.4363 2.5978 3.2248 1.8135 1.8796 3.2080 1.8985 1.2828 1.6798 1.8154 5.5158 1.3999 4.4969 1.4240 2.1876 2.0816 2.0353 1.7034 1.9049 2.1431 1.0561 1.1132 2.2244 1.4020 1.2777 1.6783 1.6126 1.7350 1.6723 1.3110 3.4315 2.0827 1.0824 1.0451 2.2885 1.0587 1.2333 5.7421 6.1085 7.0939 1.0361 1.0607 1.0866 1.0985 1.0996 1.1000 1.0845 1.0875 1.0923 1.0966 1.1016 1.0443 1.1059
irintensity: 0.3047 0.5521 9.8543 0.1710 1.8755 3.5245 3.0766 7.3627 0.7213 7.4760 0.7568 0.1656 4.5600 59.2458 248.9076 8.8650 26.4632 1.4366 0.4046 6.9116 32.2377 60.9684 4.4670 47.4186 6.4622 8.9228 0.1866 7.7693 18.5122 235.6323 0.1041 0.3680 0.1653 4.1086 11.0194 13.1469 10.7964 12.2242 7.7592 0.1399 0.9722 15.8940 13.0343 39.9787 207.1850 97.8592 106.0671 3.6647 13.5155 3.2075 9.7515 4.4710 11.5226 7.6123 10.8591 98.3894 2.9232 0.2440 320.2771 42.1247 20.0793 5.1840 13.8474 45.8308 38.1710 2.2210 0.2500 20.4608 38.4980 19.9730 60.3929 45.7077
temp: 298.150 k
press: 1.00000 atm
elementType: 8 8 7 6 6 6 6 6 6 6 6 6 6 1 1 1 1 1 1 1 1 1 1 1 1 1
symmnumber: 1
zpe: 558136.1 jmol-1
zpe.correction: 0.212583 hartree
zpe.thermalcorrener: 0.225607 hartree
zpe.thermalcorrenthalpy: 0.226551 hartree
zpe.thermalcorrgfe: 0.171448 hartree
zpe.sumelectzpe: -593.112521 hartree
zpe.sumelectthermal: -593.099496 hartree
zpe.sumelectthermalent: -593.098552 hartree
zpe.sumelectthermalfe: -593.153655 hartree
dipole: -0.3684 0.4666 2.3777
dipole: 2.4509
quadrupole: -68.5688 -74.7229 -72.7123
quadrupole: 1.6829 -5.9971 -5.0753
quadrupole: 3.4325 -2.7216 -0.7110 1.6829 -5.9971 -5.0753
hfenergy: -593.3251034 hartree
pointgroup: C01 [X(C10H13N1O2)]
dipole: 0.2183315 -0.1979259 -0.9181207 debye
dipolederiv: -0.7715385 0.2991237 -0.0913013 0.6533076 -1.345152 0.3781444 -0.2367682 0.4959682 -0.608177 -0.4784095 0.1123713 0.1051381 0.1991975 -0.6250322 0.0437154 0.0712837 0.0774502 -1.0005122 -0.925054 0.2407781 0.068797 0.3694013 -1.0575761 -0.2644973 0.1031835 -0.3085098 -0.4021427 0.8164422 -0.2134232 0.1185086 -0.292835 0.7861447 -0.1216886 0.0014232 0.1151498 0.170073 -0.0444066 -0.024543 -0.0117069 0.0541943 0.0457959 0.0519417 -0.0054999 0.0509457 0.1029637 0.0344987 0.0346826 0.001609 -0.0630783 -0.1689911 0.0210691 -0.0185325 -0.0233734 -0.0390282 -0.0587548 -0.0210571 -0.0135247 -0.0803064 0.0246046 0.0025831 0.0298749 0.0358956 0.0803922 -0.0911439 0.0109929 0.0718781 0.0068981 -0.1282518 -0.0148855 0.0275461 0.0103463 0.0443349 -0.0521944 0.0123967 -0.0789433 -0.033204 -0.1410072 -0.0041298 -0.0546904 -0.0236326 0.0147063 -0.0065646 0.0216483 -0.1114977 0.037164 -0.1320477 -0.0235402 -0.1069521 -0.0091427 0.0594602 -0.0569373 0.0269344 0.071737 0.0294123 -0.1461822 0.0273961 0.0871192 0.0277573 0.1033027 0.0765182 0.0546497 0.0139816 0.0454041 -0.152513 0.0089069 0.0060913 0.0066982 -0.0482824 0.7657838 -0.6165232 -0.2334255 -1.0196225 1.83349 -0.0987204 0.0249507 -0.3426326 1.4582285 0.0143521 0.0285855 -0.0125418 0.0073119 0.0192415 0.0041139 -0.0196283 -0.0900219 -0.0536987 0.0442891 -0.0458335 -0.0499113 -0.0293286 0.0599756 -0.0719037 -0.0552089 -0.0167346 -0.1295369 -0.0436116 0.0911711 0.0278979 0.126741 -0.0652473 -0.0062139 0.0269097 -0.037678 0.0667669 0.054922 -0.0058917 0.0023698 -0.0093371 0.0870002 -0.0387703 -0.066104 -0.0787941 -0.1508325 0.0064356 -0.0887467 0.0298543 -0.1165976 -0.0951636 0.1131082 0.0546045 0.1282329 0.0177153 -0.0113551 0.1004096 0.0063973 0.1523325 -0.0182407 -0.0472175 0.0182427 -0.047718 0.0789985 0.0658927 -0.02555 -0.0874293 -0.0227152 0.1380243 -0.0074265 -0.0687427 -0.0127777 -0.0349928 0.0269534 -0.0230827 0.1094594 -0.0127046 0.1385758 0.0169831 0.1084531 0.0161495 -0.0158693 -0.0048481 -0.0233665 0.0943034 -0.0314724 0.1515846 0.0125077 0.113262 0.0129834 -0.0501591 0.0373402 -0.0225192 -0.072341 -0.0237085 0.1482224 -0.0268021 -0.0919451 -0.0253629 -0.098592 -0.1306687 -0.0542929 -0.0250623 -0.0584437 0.1479532 -0.0078678 -0.0261824 -0.0064976 0.0869459 0.3710562 0.0614658 0.0306121 0.0527717 0.2468327 0.0226845 0.0176918 0.0458292 0.1714947 0.3610028 0.06962 0.0351414 0.0592175 0.2479594 0.0305095 0.0596182 -0.0005305 0.1764409 unknown
polarizability: 141.8519713|2.240589|92.1891226|-0.9204863|-2.3498898|115.8955086 unknown
InChI: InChI=1S/C10H13NO2/c1-2-9(13-10(11)12)8-6-4-3-5-7-8/h3-7,9H,2,11H2,1H3
charge 0 multiplicity 1
26 atoms
O  1.656189 -0.410425 -0.278454
O  1.533646 -1.327923 1.899284
N  2.522953 -2.475708 0.107565
C  0.836185 0.768791 0.178976
C  1.354416 1.973238 -0.625475
C  -0.642803 0.463424 -0.014794
C  2.824828 2.317509 -0.313988
C  -1.487158 0.32976 1.114623
C  -1.19725 0.301733 -1.311031
C  -2.864844 0.057109 0.955528
C  -2.571451 0.023116 -1.472537
C  -3.411089 -0.095041 -0.339192
C  1.87097 -1.409967 0.691457
H  1.047059 0.907092 1.256006
H  1.23456 1.770832 -1.70697
H  0.701113 2.836109 -0.391154
H  2.957754 2.573802 0.753923
H  3.162374 3.182311 -0.913332
H  3.482618 1.46119 -0.542523
H  -1.056473 0.421049 2.118424
H  -0.550665 0.381381 -2.192437
H  -3.50688 -0.044934 1.837575
H  -2.9897 -0.102857 -2.477783
H  -4.478374 -0.309736 -0.465391
H  2.738551 -2.467079 -0.886067
H  2.765973 -3.273775 0.687067
