program: Gaussian 09
title: 000052371
version: EM64L-G09RevD.01
frameworkgroup: C1[X(C14H19NO)]
method: RPBEPBE
basis: SDD
operation: Freq
keyword: #p
keyword: freq=noraman
keyword: PBEPBE/SDD
title: #p freq=noraman PBEPBE/SDD
converged: YES YES NO NO
title: Mulliken charges:
elementType: O N C C C C C C C C C C C C C C H H H H H H H H H H H H H H H H H H H
charge: -0.442783 -0.077361 -0.310905 -0.585004 0.217738 0.228913 0.162109 -0.471056 -0.391952 -0.415740 -0.409113 -0.334249 -0.226250 -0.218842 -0.360137 -0.694888 0.258793 0.269843 0.227714 0.202331 0.243281 0.194585 0.230692 0.238830 0.243117 0.192828 0.185478 0.222928 0.222769 0.195027 0.199697 0.216383 0.209439 0.211220 0.364567
chargesum: 0.00000
title: Mulliken charges with hydrogens summed into heavy atoms:
elementType: O N C C C C C C C C C C C C C C
charge: -0.078216 -0.077361 -0.052112 -0.087446 0.217738 0.228913 0.162109 -0.025445 0.033325 -0.176910 -0.165996 0.044057 -0.003322 0.003926 0.034587 -0.057846
polarizability: 2.00928705e+02 8.16596867e+00 1.63816078e+02 -2.39655828e+00 1.21775834e+01 1.14557264e+02
1716.lowfreq: -6.8134 -0.0010 -0.0004 -0.0001 6.1603 9.4392 21.0456 29.4931 45.8163
frequency: 21.0406 29.4712 45.7998 60.4769 90.1455 94.6316 113.7620 130.0592 166.5322 218.2739 228.1513 243.1698 285.0863 297.1284 315.3411 383.5779 388.5909 393.0556 428.2099 467.0519 502.9265 548.5759 572.9720 630.4602 674.6838 713.7353 726.5071 737.6450 757.6445 774.3625 796.8221 841.6618 845.8220 868.4735 890.8823 895.8971 935.0436 946.0467 960.5244 982.7390 993.6275 1000.0072 1002.9405 1043.7843 1071.7482 1075.0317 1083.3460 1094.0647 1108.9329 1132.5521 1144.9967 1160.7048 1190.1322 1197.7601 1204.8480 1208.5905 1237.2921 1253.2228 1265.4438 1274.5968 1287.2205 1289.9909 1299.1260 1334.3401 1343.2420 1351.4948 1388.3676 1400.1330 1442.0862 1443.4897 1452.8910 1456.5372 1465.0563 1470.0451 1476.7196 1479.5738 1487.7147 1604.4916 1605.6565 1618.1995 2954.2470 2967.3589 2972.1993 2973.6109 2974.8311 2995.3867 2997.6974 3022.3329 3022.7202 3042.3437 3067.1653 3070.4795 3071.5663 3095.8330 3119.9257 3131.6129 3144.1142 3158.2805 3569.7009
redmass: 4.3248 3.8026 1.7351 4.4341 3.4105 2.9496 3.3025 1.9414 3.8265 3.9599 1.1313 3.2326 5.3950 3.4138 3.1709 3.2133 1.8828 3.5028 1.5527 3.3934 3.8509 3.8283 4.6706 5.4665 3.6292 2.3686 1.1115 1.5570 1.4304 1.7010 4.0979 3.5505 1.6264 1.3162 2.2813 2.6006 1.4445 2.4371 1.4006 1.3272 3.1906 2.1617 2.8212 3.2290 2.0207 2.3919 1.6274 1.3067 2.2220 1.6968 1.3964 1.1925 1.7589 1.3893 1.4810 2.1342 1.3003 1.2691 1.4796 1.3921 1.0547 1.2006 1.3127 1.4060 2.1987 1.6213 1.2156 4.0905 1.9839 1.8462 1.6188 1.1352 1.0674 1.0757 1.0425 1.0723 1.0880 7.0744 7.3500 7.5996 1.0589 1.0594 1.0371 1.0753 1.0703 1.0751 1.0795 1.1004 1.0611 1.1009 1.1025 1.1022 1.0995 1.1038 1.0850 1.0898 1.0956 1.0999 1.0674
irintensity: 0.0194 0.1426 0.0497 0.0557 0.1239 0.0193 0.4609 0.0012 0.0193 8.6860 0.0124 1.7939 0.2109 2.4463 3.4530 4.4515 53.7214 1.3355 84.4292 7.1437 2.8095 11.8858 11.3450 8.0797 13.0760 11.8163 11.7746 1.3319 30.5818 16.8990 8.6880 55.1732 51.9604 1.2573 20.1536 13.0869 1.1130 12.0077 0.6769 0.0356 0.1899 7.3447 2.3533 0.7823 2.4525 1.0220 0.6477 6.6438 21.4850 1.8539 9.8047 1.6674 18.8641 8.1059 36.1240 1.3096 8.5575 14.9984 5.5283 16.2808 1.8183 1.4330 5.5077 1.3605 9.2466 0.8737 10.7533 6.7656 8.2197 15.1450 13.2634 6.9204 0.0618 1.5288 12.4609 3.6447 20.7800 4.2990 1.1987 0.4082 9.8832 26.7205 47.2798 10.1686 55.7421 12.3586 22.9893 15.8298 34.1856 15.2736 2.9872 121.4626 56.8206 8.8863 0.0640 9.6746 37.6933 30.9783 41.3521
temp: 298.150 k
press: 1.00000 atm
elementType: 8 7 6 6 6 6 6 6 6 6 6 6 6 6 6 6 1 1 1 1 1 1 1 1 1 1 1 1 1 1 1 1 1 1 1
symmnumber: 1
zpe: 776342.8 jmol-1
zpe.correction: 0.295693 hartree
zpe.thermalcorrener: 0.312261 hartree
zpe.thermalcorrenthalpy: 0.313205 hartree
zpe.thermalcorrgfe: 0.249384 hartree
zpe.sumelectzpe: -673.573304 hartree
zpe.sumelectthermal: -673.556737 hartree
zpe.sumelectthermalent: -673.555792 hartree
zpe.sumelectthermalfe: -673.619613 hartree
dipole: 0.3587 -0.3748 0.3591
dipole: 0.6310
quadrupole: -92.1372 -90.2110 -96.8161
quadrupole: 0.4729 -0.0584 1.0827
quadrupole: 0.9176 2.8438 -3.7614 0.4729 -0.0584 1.0827
hfenergy: -673.8689973 hartree
pointgroup: C01 [X(C14H19N1O1)]
dipole: -0.1403082 -0.1629498 -0.1240429 debye
polarizability: 201.1461523|-7.9233334|160.7166332|-2.6589291|-16.6067712|117.4392623 unknown
InChI: InChI=1S/C14H19NO/c1-2-3-4-9-14(15-16)13-10-11-7-5-6-8-12(11)13/h5-8,13,16H,2-4,9-10H2,1H3
charge 0 multiplicity 1
35 atoms
O  -1.377469 2.909086 0.967024
N  -0.285171 2.408301 0.099263
C  0.681342 0.450258 -0.92092
C  1.914187 1.327552 -1.428328
C  1.732787 -0.450215 -0.218632
C  2.81832 0.316902 -0.707608
C  -0.368748 1.102554 -0.043309
C  -1.445781 0.225853 0.564389
C  -2.743144 0.208159 -0.295661
C  1.910735 -1.586394 0.583672
C  4.151623 -0.017105 -0.428212
C  -3.834041 -0.699473 0.314103
C  3.260392 -1.930551 0.880813
C  4.350559 -1.16794 0.386403
C  -5.12886 -0.738939 -0.52957
C  -6.218993 -1.642857 0.08575
H  0.167765 -0.077546 -1.750522
H  1.911146 2.346552 -1.009724
H  2.019449 1.381687 -2.525827
H  -1.062585 -0.806417 0.671598
H  -1.698782 0.607009 1.571058
H  -2.506648 -0.140758 -1.321829
H  -3.122578 1.243441 -0.38451
H  1.081563 -2.189843 0.969315
H  5.003107 0.56267 -0.800997
H  -4.07504 -0.343844 1.337503
H  -3.439577 -1.731487 0.426393
H  3.467192 -2.80802 1.504727
H  5.370885 -1.476681 0.643108
H  -4.886992 -1.093053 -1.55264
H  -5.520557 0.29237 -0.641992
H  -7.134351 -1.65333 -0.534176
H  -5.86262 -2.686196 0.17988
H  -6.499584 -1.292532 1.097038
H  -1.165332 3.876289 1.013224
