program: Gaussian 09
title: 000052360
version: EM64L-G09RevD.01
frameworkgroup: C1[X(C11H14N4O2)]
method: RPBEPBE
basis: SDD
operation: Freq
keyword: #p
keyword: freq=noraman
keyword: PBEPBE/SDD
title: #p freq=noraman PBEPBE/SDD
converged: NO YES NO NO
title: Mulliken charges:
elementType: O O N N N N C C C C C C C C C C C H H H H H H H H H H H H H H
charge: -0.290424 -0.268547 -0.208812 -0.164489 -0.219024 -0.093813 0.118123 0.083752 0.155271 0.238676 0.199896 -0.667319 -0.616757 -0.601595 -0.309070 -0.123847 -0.745788 0.240780 0.305718 0.240665 0.271084 0.246014 0.245868 0.268158 0.249830 0.249800 0.247241 0.256179 0.234012 0.234080 0.224338
chargesum: 0.00000
title: Mulliken charges with hydrogens summed into heavy atoms:
elementType: O O N N N N C C C C C C C C C C C
charge: -0.290424 -0.268547 -0.208812 -0.164489 -0.219024 -0.093813 0.118123 0.083752 0.155271 0.238676 0.199896 0.119845 0.146210 0.166193 -0.061829 0.132332 -0.053358
polarizability: 2.73304819e+02 1.61435588e+01 1.70324204e+02 1.40324160e-02 1.65997219e-02 7.94324948e+01
1716.lowfreq: -7.2586 -0.0011 -0.0009 -0.0007 3.6525 4.5700 49.4314 83.1613 89.6940
frequency: 49.4145 83.1595 89.6914 94.4124 104.1463 120.1484 124.5354 128.1898 152.5656 170.7128 190.2855 222.7118 241.6467 273.3191 280.9664 292.1859 328.0939 330.4623 359.2166 390.5924 404.8553 422.6644 457.7722 492.9741 579.0164 625.1316 646.8210 690.5667 704.5854 724.4305 738.5613 766.0945 824.0656 832.5064 930.0695 959.9500 971.9349 973.2081 1028.6257 1044.8892 1054.3750 1098.4847 1125.8313 1129.5045 1132.6040 1147.9437 1195.8882 1213.8760 1228.2929 1257.5654 1281.4685 1296.6587 1302.7339 1353.1941 1392.0333 1397.1143 1414.2487 1426.1320 1438.5482 1457.4796 1460.4603 1470.4217 1474.6412 1476.7356 1478.4194 1481.2471 1488.7903 1495.4345 1504.4951 1569.4644 1609.9820 1642.1076 1666.8672 2964.7551 2992.7347 3006.9903 3011.7355 3035.8822 3079.8491 3086.1184 3095.9075 3103.5595 3111.4161 3115.7925 3127.3693 3138.2717 3138.5679
redmass: 3.9314 3.0798 3.7443 1.0944 3.6084 1.6027 1.2558 2.0540 1.2963 2.8551 1.3533 3.6214 5.4030 4.5665 3.3878 3.3036 3.2977 5.3109 3.5549 9.1234 6.3755 7.4617 7.0019 5.4266 7.0565 4.8145 9.1965 5.0954 10.1741 6.3772 11.3688 4.8431 1.8428 4.2665 2.0050 5.9069 2.3179 1.0691 2.8235 1.5809 3.0477 2.0540 1.3040 1.3034 1.2986 2.2883 3.8154 3.7143 2.7395 3.1347 2.3582 1.5200 5.1139 2.8399 2.7528 1.2374 1.3486 1.2814 2.3544 1.0474 1.4822 1.1904 1.0436 1.1452 1.0428 1.2327 1.4460 1.0441 2.7032 7.5477 10.3912 9.5000 5.8147 1.0371 1.0335 1.0335 1.0327 1.0960 1.0981 1.1027 1.1024 1.1022 1.1023 1.0943 1.0874 1.1023 1.1012
irintensity: 0.0898 0.6093 0.3727 0.1121 0.2299 0.6640 4.9553 10.9109 0.4920 4.0255 0.8287 9.8772 0.8985 0.0318 0.0167 0.4960 6.2670 0.0803 9.3960 27.4375 0.2713 0.5149 8.9816 23.2622 5.6910 1.9845 3.1175 0.7259 8.5998 5.7920 15.4585 0.7602 0.4454 1.1021 27.9933 41.5730 4.7385 60.1771 101.0410 0.0530 10.7644 0.0018 0.5772 0.2083 0.1842 0.9528 18.5863 70.9300 3.1019 11.3859 36.9838 31.7119 24.9699 23.4587 7.6049 10.8984 11.0238 58.2137 200.6773 15.7064 28.4504 9.4576 17.4251 27.3114 16.6124 3.7157 101.0045 18.8553 95.7858 52.9069 648.5108 515.0786 61.3439 37.4472 43.5893 31.6979 33.1255 18.4575 18.5354 18.5847 18.5690 18.0378 2.6023 2.2687 27.4177 0.9043 0.4903
temp: 298.150 k
press: 1.00000 atm
elementType: 8 8 7 7 7 7 6 6 6 6 6 6 6 6 6 6 6 1 1 1 1 1 1 1 1 1 1 1 1 1 1
symmnumber: 1
zpe: 640104.8 jmol-1
zpe.correction: 0.243803 hartree
zpe.thermalcorrener: 0.260926 hartree
zpe.thermalcorrenthalpy: 0.261871 hartree
zpe.thermalcorrgfe: 0.199322 hartree
zpe.sumelectzpe: -795.805269 hartree
zpe.sumelectthermal: -795.788146 hartree
zpe.sumelectthermalent: -795.787202 hartree
zpe.sumelectthermalfe: -795.849750 hartree
dipole: -5.2495 0.6363 -0.0055
dipole: 5.2879
quadrupole: -92.8832 -100.8063 -100.5644
quadrupole: -0.6882 -0.0002 -0.0098
quadrupole: 5.2014 -2.7217 -2.4797 -0.6882 -0.0002 -0.0098
hfenergy: -796.0490724 hartree
pointgroup: C01 [X(C11H14N4O2)]
dipole: 2.0695925 0.2110645 0.0193149 debye
polarizability: 272.6590098|-18.0832204|170.8691923|0.3448524|2.9666011|79.5333161 unknown
InChI: InChI=1S/C11H14N4O2/c1-5-6-7-12-9-8(13(7)2)10(16)15(4)11(17)14(9)3/h5-6H,1-4H3
charge 0 multiplicity 1
31 atoms
O  -1.74413 2.682236 0.058214
O  -3.568645 -1.664566 -0.094687
N  1.041826 1.258293 0.024026
N  -1.228508 -1.484923 -0.077531
N  -2.629873 0.482312 -0.018059
N  1.196824 -1.028029 -0.050768
C  -0.268188 0.756697 0.002425
C  -0.126343 -0.643421 -0.043952
C  -1.541744 1.424712 0.017707
C  1.899782 0.154159 -0.008178
C  -2.533621 -0.938784 -0.065477
C  1.412547 2.68375 0.077356
C  -1.047831 -2.948337 -0.126335
C  -4.009162 1.022125 -0.006354
C  3.348719 0.275527 0.002379
C  4.186134 -0.803596 -0.027493
C  5.689362 -0.726236 -0.018487
H  2.002793 2.964257 -0.812138
H  0.48298 3.273613 0.096636
H  1.998468 2.897722 0.987982
H  -2.047284 -3.406676 -0.138365
H  -0.481371 -3.288285 0.756792
H  -0.4874 -3.230056 -1.033591
H  -3.929955 2.118314 0.032093
H  -4.55678 0.641229 0.871062
H  -4.547836 0.703677 -0.913731
H  3.764514 1.290259 0.036367
H  3.727122 -1.801803 -0.060636
H  6.107172 -1.269596 0.851998
H  6.114694 -1.210499 -0.919694
H  6.052037 0.315823 0.017639
