program: Gaussian 09
title: 000052344
version: EM64L-G09RevD.01
frameworkgroup: C1[X(C10H12N2)]
method: RPBEPBE
basis: SDD
operation: Freq
keyword: #pfreq=noraman
keyword: PBEPBE/SDD
title: #p freq=noraman PBEPBE/SDD
converged: YES YES NO NO
title: Mulliken charges:
elementType: N N C C C C C C C C C C H H H H H H H H H H H H
charge: -0.436545 -0.013114 -0.319477 -0.442559 0.468204 -0.408885 -0.369229 -0.427774 -0.220072 -0.194321 -0.274244 -0.152597 0.208572 0.209359 0.231852 0.234466 0.296834 0.249445 0.249554 0.234100 0.213062 0.217910 0.220163 0.225296
chargesum: 0.00000
title: Mulliken charges with hydrogens summed into heavy atoms:
elementType: N N C C C C C C C C C C
charge: -0.139711 -0.013114 0.098454 0.023759 0.468204 0.090113 -0.135129 -0.214713 -0.002161 0.025842 -0.048948 -0.152597
polarizability: 1.80921907e+02 -7.71711799e+00 1.10963579e+02 1.81239790e-01 -1.57896100e-02 6.14135888e+01
1716.lowfreq: -18.9910 -0.0005 -0.0002 0.0002 5.1615 6.3240 27.0242 41.3099 62.9594
frequency: 25.1312 40.3770 62.9547 84.5141 118.9544 145.7929 224.4776 262.5321 284.1597 296.0117 371.2356 410.0293 472.0352 505.6609 521.2477 601.8013 614.7411 690.3780 748.5589 755.5812 812.3695 823.5054 860.7645 872.3764 931.1144 955.2006 974.7376 977.1687 1023.2664 1041.2498 1063.5018 1082.8518 1097.7624 1133.0165 1169.8242 1181.8765 1188.8984 1252.2207 1266.0470 1289.1269 1290.9680 1328.8680 1335.3010 1367.9698 1389.7852 1431.7393 1450.4138 1476.8654 1482.5573 1500.6040 1511.3226 1591.6882 1626.4752 2200.8482 2912.8348 2947.3069 2988.1085 2998.8411 3037.5030 3067.4056 3108.0792 3123.8902 3136.4514 3150.5126 3166.8870 3572.9145
redmass: 3.2931 2.9221 5.7335 2.6724 2.7776 6.5568 3.4136 5.1462 1.1884 4.6595 3.6054 2.9191 3.9723 2.6921 7.1606 5.2453 6.4254 1.8277 1.1689 1.6942 1.2624 5.0788 1.3237 1.4561 5.1917 1.3596 1.2943 5.8732 2.2773 3.9322 2.7984 1.6980 1.5919 3.2522 1.0478 1.1775 1.1097 1.2998 1.1681 1.0728 1.5978 1.4053 1.5866 1.7877 2.9405 2.3687 1.0827 1.0864 1.8487 1.2680 1.9704 5.0969 6.2596 12.4397 1.0571 1.1032 1.0590 1.0584 1.1010 1.1047 1.0873 1.0857 1.0927 1.0938 1.1008 1.0771
irintensity: 12.1061 3.8886 4.6389 0.3806 10.5803 2.3429 0.8993 2.4571 84.8967 0.2017 1.5642 0.0908 1.1261 13.4678 3.2957 3.1993 0.2313 42.6615 22.7365 69.8514 0.4235 8.9489 1.1864 8.3465 2.3917 0.0559 0.5365 4.5612 5.9993 1.2492 2.4664 5.2871 0.1620 15.8582 1.5230 0.0944 11.5562 3.1124 1.0657 1.0626 32.2515 24.1804 19.9387 8.9698 47.3034 19.5913 7.8066 8.0526 3.3781 141.8365 108.3424 10.6548 210.7900 13.2859 69.4941 42.0540 0.5498 29.6513 0.2593 37.7971 15.8466 4.7752 27.7378 43.6728 14.5867 27.7310
temp: 298.150 k
press: 1.00000 atm
elementType: 7 7 6 6 6 6 6 6 6 6 6 6 1 1 1 1 1 1 1 1 1 1 1 1
symmnumber: 1
zpe: 516961.4 jmol-1
zpe.correction: 0.196900 hartree
zpe.thermalcorrener: 0.208972 hartree
zpe.thermalcorrenthalpy: 0.209916 hartree
zpe.thermalcorrgfe: 0.156691 hartree
zpe.sumelectzpe: -496.869762 hartree
zpe.sumelectthermal: -496.857690 hartree
zpe.sumelectthermalent: -496.856745 hartree
zpe.sumelectthermalfe: -496.909971 hartree
dipole: -1.7385 0.9495 0.0715
dipole: 1.9822
quadrupole: -104.5864 -63.8272 -75.3016
quadrupole: 8.0900 0.2541 -0.1046
quadrupole: -23.3480 17.4112 5.9368 8.0900 0.2541 -0.1046
hfenergy: -497.0666619 hartree
pointgroup: C01 [X(C10H12N2)]
dipole: -0.6857615 0.3706721 0.0221082 debye
dipolederiv: -1.8029947 0.0410452 -0.0125506 0.2503687 -0.2385206 -0.0084824 0.0041278 -0.0117348 -0.4871006 -0.3524245 -0.0120551 -0.0005264 0.079311 -0.2237984 0.0003316 0.000608 0.0000776 -0.2324914 0.5880775 0.1681911 0.0054264 0.4822592 0.3517581 0.0109451 -0.0010388 0.0082188 0.3921013 0.0618635 0.0107172 0.0002087 0.0573848 0.0602476 -0.0031348 0.0015788 -0.0050265 0.170564 1.6826959 -0.2174608 0.0159992 -0.53471 0.0115333 -0.0024226 0.0214855 0.0002387 0.1483591 -0.0660909 0.049062 -0.0004533 0.0616272 0.1465757 -0.0008008 -0.0010643 -0.0004247 0.2442622 -0.3496953 -0.0478744 0.0003038 0.5149341 -0.0511443 0.0050089 -0.0055104 -0.0015856 -0.2592111 -0.5123867 0.1295843 -0.003596 -0.2719471 0.0745085 -0.0046277 -0.0006954 -0.0005288 -0.2440325 0.2678622 0.1276249 0.0033063 -0.0536734 0.1742432 -0.0025558 0.0043636 -0.0003631 -0.1343875 0.2179034 -0.1087263 0.0042244 -0.004339 0.2137932 -0.0020731 0.0039348 -0.0029377 -0.1286112 -0.148001 -0.0666227 0.0016366 -0.03195 -0.2905288 0.0001145 0.0010813 -0.000831 -0.2329544 0.172486 -0.1041234 -0.0003888 -0.214925 -0.0281264 -0.0003627 -0.0019813 0.0000653 -0.0610359 -0.0278023 0.0107047 0.0108201 -0.1369992 -0.0653485 -0.1095865 -0.0614497 -0.1216539 -0.101075 -0.0175486 0.0123503 -0.0129803 -0.1294848 -0.0652602 0.1052117 0.0543764 0.1187322 -0.0935206 0.0570047 -0.0135941 -0.0072027 0.0114296 -0.0157028 0.097584 -0.0098412 0.1088319 -0.0488023 0.0580661 -0.0119778 0.0082363 0.0113305 -0.0096529 -0.0952209 0.0118324 -0.1063388 -0.0519676 0.1420612 -0.0086802 -0.0028971 -0.0469701 0.095672 0.0041722 -0.012149 0.0083992 0.3053772 0.057172 0.0310669 0.0113772 0.0068686 0.0374715 -0.0722047 0.0014212 -0.099865 -0.0056268 0.0566592 0.0305285 -0.0102829 0.0065921 0.0334934 0.0733066 -0.0010785 0.1007539 -0.001437 -0.0208586 -0.1119671 -0.0021305 -0.1275413 -0.013748 -0.0007589 -0.0019521 -0.00033 0.1698857 0.0359853 0.1012679 -0.0021213 0.0685576 -0.1088567 0.0022771 -0.0017108 0.0026435 0.1673375 0.0610061 0.0567751 -0.0013511 0.0822442 -0.1208723 0.0024086 -0.0011937 0.0022422 0.1520902 -0.0248056 -0.1115667 -0.0012635 -0.1263779 -0.0403052 -0.000218 -0.0013852 0.0000722 0.152902 -0.1362349 0.0457304 -0.0037942 0.0460103 0.0725686 0.0010887 -0.0037594 0.0013442 0.1793747 unknown
polarizability: 180.9798029|-7.40935|110.8967169|1.006205|-0.2570674|61.4225546 unknown
InChI: InChI=1S/C10H12N2/c11-8-4-5-9-12-10-6-2-1-3-7-10/h1-3,6-7,12H,4-5,9H2
charge 0 multiplicity 1
24 atoms
N  -0.122951 -0.603756 0.026194
N  5.882095 -0.409086 0.038145
C  0.948251 0.389346 0.035095
C  2.324445 -0.304558 0.028671
C  -1.483867 -0.282118 0.010383
C  3.474947 0.737562 0.043873
C  -1.93369 1.071331 -0.001926
C  -2.459012 -1.325049 0.00578
C  -3.315659 1.35939 -0.019526
C  -3.832911 -1.020364 -0.010974
C  -4.277864 0.324709 -0.024239
C  4.807777 0.110437 0.040505
H  0.869103 1.043634 0.932679
H  0.866992 1.055081 -0.853032
H  2.416099 -0.963232 0.913205
H  2.418107 -0.94189 -0.870763
H  0.136054 -1.5891 0.052039
H  3.391907 1.382127 0.940513
H  3.396888 1.402903 -0.837918
H  -1.21232 1.894545 0.00344
H  -2.12962 -2.372441 0.015002
H  -3.640782 2.406568 -0.02892
H  -4.562437 -1.838735 -0.014056
H  -5.347449 0.557295 -0.037569
