program: Gaussian 09
title: 000052345
version: EM64L-G09RevD.01
frameworkgroup: C1[X(C17H15NO)]
method: RPBEPBE
basis: SDD
operation: Freq
keyword: #p
keyword: freq=noraman
keyword: PBEPBE/SDD
title: #p freq=noraman PBEPBE/SDD
converged: YES YES NO NO
title: Mulliken charges:
elementType: O N C C C C C C C C C C C C C C C C C H H H H H H H H H H H H H H H
charge: -0.193168 -0.019947 0.084754 -0.640208 0.405349 0.503398 0.198735 -0.376937 -0.392948 -0.242661 -0.396408 -0.394385 -0.775118 -0.230356 -0.243001 -0.239033 -0.231957 -0.234657 -0.240744 0.241919 0.256102 0.256591 0.267974 0.242598 0.235313 0.261270 0.255630 0.263130 0.232532 0.232092 0.234001 0.224763 0.227007 0.228371
chargesum: 0.00000
title: Mulliken charges with hydrogens summed into heavy atoms:
elementType: O N C C C C C C C C C C C C C C C C C
charge: -0.193168 -0.019947 0.084754 -0.142187 0.405349 0.503398 0.198735 -0.120346 -0.124974 -0.242661 -0.153811 -0.159072 0.004913 0.002176 -0.010909 -0.005032 -0.007194 -0.007650 -0.012374
polarizability: 1.78709642e+02 -1.79453531e+00 1.96478605e+02 2.42711868e+01 -8.77920119e+00 1.53074984e+02
1716.lowfreq: -3.7113 -0.0009 -0.0007 -0.0006 5.7502 10.8236 27.1454 42.4481 49.6839
frequency: 26.8756 42.4295 49.6770 55.7459 71.7244 102.1038 117.6449 129.2869 151.3535 169.3722 186.8947 227.3250 266.6807 312.9190 348.6877 383.9176 403.8756 405.2144 409.9961 479.7785 485.3186 498.9335 550.3674 554.8038 599.9309 615.8968 617.9776 625.5968 678.7420 705.5366 706.9668 760.2633 771.3631 797.5623 843.1982 854.1568 858.3844 908.7254 922.7894 940.7242 953.1233 977.4320 978.7440 984.2942 990.1621 991.1245 996.3438 1001.7191 1025.9808 1028.0894 1036.3631 1062.2256 1086.7590 1102.6212 1148.7750 1172.7721 1173.7763 1175.7944 1191.5821 1200.4748 1219.2889 1242.0145 1312.1568 1327.7700 1332.2785 1374.7678 1379.1396 1383.2692 1436.7510 1441.3818 1441.8197 1449.8468 1462.0330 1481.2857 1485.0433 1590.8932 1593.1238 1607.2820 1615.2532 1637.0204 2182.8267 2990.0461 3019.2123 3074.4292 3085.4056 3121.0227 3124.1531 3126.5003 3127.3201 3132.9394 3136.3244 3143.1881 3147.3683 3152.8088 3163.7311 3167.6555
redmass: 4.7208 4.2072 4.1025 3.8380 5.4127 4.7648 5.2058 1.5742 2.5389 5.8200 5.0654 4.5137 4.3984 4.5265 2.5996 3.2519 3.0058 2.8251 5.2792 6.3437 4.6827 3.6240 4.6593 3.7042 4.1648 6.3468 6.2543 4.0570 5.0244 1.7427 1.7548 1.8545 2.0543 4.2601 2.6479 1.2504 1.2529 2.0821 1.5095 1.9557 2.2713 1.4719 2.1078 1.4417 5.3631 5.6049 1.3469 1.3290 2.3473 2.1953 1.9612 2.9337 1.6134 1.7771 2.3036 1.3367 1.9483 1.0519 1.1339 1.1242 2.4704 1.7479 1.4146 1.3384 1.2591 1.2287 7.5124 7.6974 2.2404 1.0796 2.1337 1.0534 1.1033 2.1241 2.2804 6.0817 6.0125 5.8784 6.1161 9.2076 12.6514 1.0372 1.0618 1.0953 1.1006 1.0849 1.0877 1.0858 1.1008 1.0876 1.0920 1.0921 1.0963 1.0962 1.1016 1.1016
irintensity: 0.1672 0.3266 5.6047 0.7764 0.9871 0.2313 1.9915 1.3121 3.5689 3.3411 1.7150 1.0132 0.8700 0.7141 0.6111 0.3577 0.0708 0.0287 0.2831 5.7647 5.0905 2.1262 29.0419 2.8840 10.0849 0.1431 0.1954 16.9991 6.1416 40.0545 79.8508 16.7019 48.5306 2.5618 0.6395 0.2532 0.3485 0.7794 1.2781 2.0013 3.7610 3.1430 12.7679 0.4718 1.2424 0.4116 0.2083 0.5708 1.7823 5.2516 9.3685 1.1862 13.9954 2.9059 20.3166 42.8202 88.8760 0.2212 1.4602 0.9585 0.0263 2.3545 1.0040 1.6215 0.6161 61.8047 0.1294 0.0855 13.1138 23.5537 8.0033 20.2370 14.5279 20.6097 14.9193 2.2402 1.2298 8.9041 4.2147 125.9136 9.3458 0.2686 12.2824 4.5386 6.9972 4.4771 0.6250 1.3853 12.1004 1.3344 18.1080 8.1280 36.1421 19.6819 19.7356 21.7051
temp: 298.150 k
press: 1.00000 atm
elementType: 8 7 6 6 6 6 6 6 6 6 6 6 6 6 6 6 6 6 6 1 1 1 1 1 1 1 1 1 1 1 1 1 1 1
symmnumber: 1
zpe: 703549.2 jmol-1
zpe.correction: 0.267968 hartree
zpe.thermalcorrener: 0.285282 hartree
zpe.thermalcorrenthalpy: 0.286226 hartree
zpe.thermalcorrgfe: 0.221404 hartree
zpe.sumelectzpe: -785.435129 hartree
zpe.sumelectthermal: -785.417814 hartree
zpe.sumelectthermalent: -785.416870 hartree
zpe.sumelectthermalfe: -785.481693 hartree
dipole: -0.8973 2.6335 -0.2143
dipole: 2.7904
quadrupole: -104.3247 -103.6256 -119.6844
quadrupole: -1.2645 -1.8198 0.5045
quadrupole: 4.8868 5.5860 -10.4728 -1.2645 -1.8198 0.5045
hfenergy: -785.7030966 hartree
pointgroup: C01 [X(C17H15N1O1)]
dipole: -0.3377628 -1.0387716 0.1100269 debye
polarizability: 175.5338404|0.9609873|196.4345847|-25.6142904|-9.2446542|156.294805 unknown
InChI: InChI=1S/C17H15NO/c1-14(19)17(13-18,16-10-6-3-7-11-16)12-15-8-4-2-5-9-15/h2-11H,12H2,1H3
charge 0 multiplicity 1
34 atoms
O  -2.169468 1.838345 1.964462
N  -0.26694 2.078965 -2.22193
C  -0.826506 0.929058 0.118597
C  0.398225 1.130772 1.098041
C  -1.198177 -0.570224 -0.034041
C  1.701486 0.524768 0.603025
C  -2.104265 1.641792 0.727965
C  -1.046261 -1.259075 -1.261056
C  -1.684233 -1.27267 1.099892
C  -0.517136 1.544093 -1.185065
C  2.038308 -0.822536 0.895173
C  2.613601 1.303098 -0.155854
C  -3.221004 2.012834 -0.226184
C  -1.370112 -2.631697 -1.352577
C  -2.008449 -2.642985 1.004918
C  -1.852294 -3.328629 -0.222313
C  3.252976 -1.379136 0.436848
C  3.82889 0.749632 -0.616405
C  4.152895 -0.59465 -0.321268
H  0.514044 2.217804 1.261199
H  0.095903 0.697382 2.065996
H  -0.664425 -0.731245 -2.14179
H  -1.818187 -0.749878 2.053979
H  1.346326 -1.436658 1.483414
H  2.370142 2.346971 -0.388481
H  -3.437598 1.183405 -0.922943
H  -4.125353 2.279504 0.341359
H  -2.91455 2.877375 -0.845357
H  -1.240118 -3.154743 -2.306296
H  -2.385628 -3.172809 1.886538
H  -2.104086 -4.392228 -0.296232
H  3.498671 -2.420502 0.673826
H  4.521266 1.36584 -1.200727
H  5.097157 -1.024471 -0.674115
