program: Gaussian 09
title: 000052307
version: EM64L-G09RevD.01
frameworkgroup: C1[X(C14H12O)]
method: RPBEPBE
basis: SDD
operation: Freq
keyword: #pfreq=noraman
keyword: PBEPBE/SDD
title: #p freq=noraman PBEPBE/SDD
converged: YES YES NO NO
title: Mulliken charges:
elementType: O C C C C C C C C C C C C C C H H H H H H H H H H H H
charge: -0.461500 0.111491 -0.667479 0.215937 0.305060 0.147567 0.377413 -0.420950 -0.429803 -0.386148 -0.476478 -0.502012 -0.223936 -0.237900 -0.238329 0.229255 0.281244 0.239697 0.241889 0.236746 0.227978 0.211390 0.199812 0.224826 0.223664 0.224388 0.346179
chargesum: 0.00000
title: Mulliken charges with hydrogens summed into heavy atoms:
elementType: O C C C C C C C C C C C C C C
charge: -0.115322 0.111491 -0.156980 0.215937 0.305060 0.147567 0.377413 -0.181253 -0.187914 -0.149402 -0.248500 -0.090810 0.000890 -0.014236 -0.013940
polarizability: 2.26117831e+02 1.03062251e+01 1.69318947e+02 5.09186956e+00 -5.87356824e+00 6.92938135e+01
1716.lowfreq: -5.4301 -2.1077 -0.0003 -0.0002 0.0007 6.4694 58.3490 81.6340 111.4882
frequency: 58.3476 81.6273 111.4851 149.1897 188.2289 232.3001 255.9104 266.3201 278.4429 348.4020 422.6506 437.8514 470.7776 480.9361 517.6099 549.0646 570.7820 617.2478 626.5381 692.3730 707.1882 734.6641 766.0699 793.6546 807.4552 831.3030 869.4202 885.9464 907.1679 927.2749 947.8354 959.4201 976.7540 984.5523 989.4457 1021.1141 1057.9658 1077.3447 1109.9750 1124.6865 1163.9985 1167.5696 1180.6885 1184.2176 1194.2943 1202.4500 1227.6744 1257.7227 1290.5053 1307.0924 1382.0429 1388.1301 1403.2733 1428.9017 1435.3621 1452.7863 1468.2978 1473.5513 1488.9414 1590.3873 1603.8166 1613.7360 1622.6725 2927.0822 2980.7742 2989.2506 3039.6830 3118.5208 3119.6008 3126.9118 3131.5067 3140.5834 3155.5366 3159.6276 3554.1183
redmass: 4.1523 4.2146 4.1842 4.0585 3.5484 2.2482 1.1790 3.4678 3.2154 5.3820 2.9345 4.6399 2.8177 4.2578 3.6275 4.5000 4.6244 5.1591 5.9215 4.7415 2.7121 1.6135 1.4524 4.0673 2.0322 4.6061 1.3768 3.3113 1.5665 1.8285 6.1625 1.7205 1.3944 1.3313 2.0002 2.1389 3.0517 2.0918 1.7715 1.1542 1.2314 1.1367 1.2122 1.9522 1.5053 1.5995 1.7241 1.5842 1.8020 2.1526 7.4671 2.7311 1.6056 1.1964 2.5053 2.6733 3.1041 1.1187 3.3522 6.7346 7.4086 7.7004 7.2479 1.0596 1.0663 1.1015 1.0930 1.0865 1.0853 1.0894 1.0909 1.0946 1.0990 1.1003 1.0664
irintensity: 1.4242 3.6387 0.5823 1.8812 7.1038 8.5696 145.3265 0.8592 6.2200 1.6181 4.8194 2.8967 1.3166 2.3320 1.1952 2.8374 4.1221 1.7120 9.3228 4.5815 10.6754 3.2545 135.2820 1.3262 18.3833 5.8694 0.6395 3.9697 6.3739 0.6590 50.5006 7.3938 2.4838 0.0602 3.1632 8.4662 4.3862 4.1410 8.8466 1.9267 26.7121 1.5816 7.6312 5.6927 3.0357 15.2040 8.6046 0.2506 1.1612 1.3832 10.2825 5.7373 12.8259 18.5749 17.7118 11.8124 0.3594 6.1535 3.3080 0.3852 1.1424 3.7963 0.1099 72.4197 12.5596 52.4758 3.2854 3.6579 3.2412 6.9961 14.0228 32.2502 39.5911 36.3527 4.2319
temp: 298.150 k
press: 1.00000 atm
elementType: 8 6 6 6 6 6 6 6 6 6 6 6 6 6 6 1 1 1 1 1 1 1 1 1 1 1 1
symmnumber: 1
zpe: 567069.6 jmol-1
zpe.correction: 0.215985 hartree
zpe.thermalcorrener: 0.227962 hartree
zpe.thermalcorrenthalpy: 0.228906 hartree
zpe.thermalcorrgfe: 0.177840 hartree
zpe.sumelectzpe: -614.879836 hartree
zpe.sumelectthermal: -614.867859 hartree
zpe.sumelectthermalent: -614.866915 hartree
zpe.sumelectthermalfe: -614.917981 hartree
dipole: 1.4482 -1.0900 1.4348
dipole: 2.3117
quadrupole: -71.6107 -72.9283 -94.3851
quadrupole: -4.9882 4.5328 -3.6804
quadrupole: 8.0307 6.7131 -14.7438 -4.9882 4.5328 -3.6804
hfenergy: -615.0958215 hartree
pointgroup: C01 [X(C14H12O1)]
dipole: -0.5425678 0.4579036 0.568435 debye
polarizability: 226.4467407|8.3746652|168.875808|-8.5219831|4.0583726|69.4080434 unknown
InChI: InChI=1S/C14H12O/c15-9-11-5-3-7-13-12-6-2-1-4-10(12)8-14(11)13/h1-7,15H,8-9H2
charge 0 multiplicity 1
27 atoms
O  -2.937984 2.294504 -0.712581
C  -0.911508 0.252598 0.154802
C  -0.040815 1.501804 0.173048
C  -0.093828 -0.909465 0.018329
C  1.369388 0.938597 0.058587
C  1.319082 -0.486167 -0.037437
C  -2.316564 0.142657 0.232299
C  -0.672514 -2.197462 -0.034169
C  2.604416 1.610014 0.0325
C  2.506956 -1.240854 -0.160454
C  -2.887838 -1.155047 0.173236
C  -3.193434 1.362563 0.409644
C  -2.078479 -2.310228 0.04413
C  3.796954 0.852622 -0.090375
C  3.746853 -0.560934 -0.186313
H  -0.180748 2.095442 1.099359
H  -0.306438 2.174047 -0.663724
H  -0.049239 -3.092878 -0.13613
H  2.651145 2.70298 0.103692
H  2.4753 -2.333946 -0.234621
H  -3.978395 -1.262962 0.221664
H  -4.260138 1.057794 0.428929
H  -2.955168 1.864176 1.3743
H  -2.550579 -3.298038 0.000523
H  4.766572 1.362939 -0.112811
H  4.678696 -1.129848 -0.281569
H  -3.448892 3.129791 -0.558659
