program: Gaussian 09
title: 000052308
version: EM64L-G09RevD.01
frameworkgroup: C1[X(C13H7Br2NO3)]
method: RPBEPBE
basis: SDD
operation: Freq
keyword: #p
keyword: freq=noraman
keyword: PBEPBE/SDD
title: #p freq=noraman PBEPBE/SDD
converged: NO YES NO NO
title: Mulliken charges:
elementType: Br Br O O O N C C C C C C C C C C C C C H H H H H H H
charge: 0.035322 0.072757 -0.380322 -0.210634 -0.211886 0.015928 -0.696534 0.329900 0.433571 0.174048 0.229466 -0.583415 -0.650785 -0.346126 -0.371353 0.413108 0.565570 -0.390953 -0.446288 0.272809 0.272811 0.301056 0.252025 0.267082 0.289128 0.363714
chargesum: 0.00000
title: Mulliken charges with hydrogens summed into heavy atoms:
elementType: Br Br O O O N C C C C C C C C C C C C C
charge: 0.035322 0.072757 -0.016607 -0.210634 -0.211886 0.015928 -0.150913 0.329900 0.433571 0.174048 0.229466 -0.282359 -0.650785 -0.094101 -0.104272 0.413108 0.565570 -0.101825 -0.446288
polarizability: 3.81830142e+02 -8.37471917e-03 2.29472286e+02 -1.46635550e-02 1.88102425e-03 6.91696031e+01
1716.lowfreq: -3.9562 -0.0008 -0.0006 -0.0002 4.6762 5.6730 41.6693 51.7568 77.2738
frequency: 41.6586 51.7563 77.2736 83.4148 88.9423 115.8058 130.5131 181.0501 206.2602 206.9853 256.5813 261.7201 279.8400 281.8959 312.4371 371.1398 427.4247 435.1729 448.9639 458.0422 507.3274 514.0238 527.8207 590.3568 601.6482 624.5173 634.9968 688.7957 695.3352 732.6795 733.1481 761.4365 763.2506 785.9707 851.3342 892.0109 897.4492 905.8793 968.5260 968.8211 989.9596 1017.9321 1070.0917 1121.3822 1136.4473 1139.4946 1169.0008 1186.8826 1204.2576 1220.6755 1252.7401 1273.5049 1310.6754 1357.2600 1384.3869 1397.1393 1410.9467 1427.3521 1437.8581 1454.7563 1477.4383 1563.6088 1590.4132 1604.7567 1621.8697 2990.3975 3034.7199 3149.8383 3167.5607 3173.2771 3186.0857 3476.8478
redmass: 10.3074 12.1016 18.8898 6.8933 6.3496 26.7062 7.2852 11.4642 22.6636 3.2655 9.8019 7.1595 2.8367 8.7214 8.6450 6.0017 6.0559 2.9893 1.1148 8.5645 4.3299 4.1475 6.5169 6.6538 5.0285 4.8934 8.7836 5.3679 8.2555 5.6275 6.5551 9.1201 3.5661 6.5424 1.4531 1.5967 4.6318 1.6617 4.1885 1.8286 1.3620 8.8827 1.9738 1.8457 1.5995 1.1417 2.8440 3.1462 2.7540 2.4806 1.6542 1.4242 4.9123 9.4917 3.5712 5.5312 3.9618 1.3524 4.4456 4.2788 4.5280 8.1187 8.1226 9.2540 7.8660 1.0613 1.0991 1.0907 1.0929 1.0929 1.0950 1.0649
irintensity: 1.6754 0.0694 0.8466 0.1698 0.0516 0.0132 3.2936 3.2673 1.4300 1.8309 5.4017 0.0399 3.7793 0.2825 1.5361 2.8580 1.3512 13.9081 136.4387 9.5173 0.1038 0.0998 11.9204 16.8637 30.9369 0.4548 8.6768 19.5083 40.9800 0.0070 5.2761 31.2423 5.5234 14.6121 40.3585 12.2572 4.3931 1.3646 10.8089 22.4038 0.8650 22.7266 68.0752 3.3747 320.5775 0.0968 16.4743 84.9244 280.6819 314.1891 200.0362 1.8546 78.3133 93.1410 44.1353 24.8131 92.5433 15.0578 27.0958 38.3424 10.4242 33.9078 18.2453 53.3348 98.0857 3.3908 2.2779 5.7417 0.4843 1.8552 1.7662 103.1852
temp: 298.150 k
press: 1.00000 atm
elementType: 35 35 8 8 8 7 6 6 6 6 6 6 6 6 6 6 6 6 6 1 1 1 1 1 1 1
symmnumber: 1
zpe: 444782.1 jmol-1
zpe.correction: 0.169409 hartree
zpe.thermalcorrener: 0.185560 hartree
zpe.thermalcorrenthalpy: 0.186504 hartree
zpe.thermalcorrgfe: 0.123454 hartree
zpe.sumelectzpe: -805.546423 hartree
zpe.sumelectthermal: -805.530272 hartree
zpe.sumelectthermalent: -805.529328 hartree
zpe.sumelectthermalfe: -805.592378 hartree
dipole: -4.3420 1.3066 0.0010
dipole: 4.5344
quadrupole: -178.4635 -114.8244 -128.8817
quadrupole: -6.8751 0.0088 -0.0003
quadrupole: -37.7403 25.8988 11.8415 -6.8751 0.0088 -0.0003
hfenergy: -805.7158317 hartree
pointgroup: C01 [X(C13H7Br2N1O3)]
dipole: -1.7292567 0.4383547 0.0003935 debye
dipolederiv: -0.1907636 0.1285055 0.0000044 0.2445565 -0.596184 -0.0000096 -0.0000115 -0.0000504 0.005976 -0.3573905 -0.2897139 0.0000214 -0.4270988 -0.3553592 -0.0000132 -0.0000341 -0.0000854 0.015052 -1.679738 0.3675025 0.000041 0.4813745 -0.2154896 -0.0000334 -0.0000001 -0.0001771 -0.3683382 -1.0815207 0.2046597 0.0000321 0.4369031 -0.5990827 0.000061 0.0004188 -0.000119 -0.2306878 -0.8534217 -0.1801885 0.0000336 -0.5199952 -0.7091806 -0.0001116 0.0003138 0.0002973 -0.2327745 2.5997749 0.0460056 -0.0002052 0.2502358 1.0638382 0.000035 -0.0006099 -0.0002339 0.1815014 0.0496859 -0.0288352 -0.0000003 -0.0142305 -0.121773 0.0000009 0.0001507 0.0004014 0.126022 -0.4749787 -0.2320705 0.0000237 -0.5951925 0.0811951 0.0000202 -0.000102 -0.0003557 -0.0375397 0.0463537 0.026166 0.0000012 0.1597837 -0.1568455 0.0000013 -0.0000151 -0.0002906 0.0446514 1.1156797 -0.1591167 -0.0000351 0.0314957 -0.0415242 0.0000002 -0.0000316 0.0000729 0.0236116 -0.5456225 0.1386778 0.0000203 -0.0164141 -0.0527055 -0.0000076 0.0000036 0.0000827 -0.0139886 0.5302403 0.1633689 -0.0000194 -0.1888671 -0.0367552 0.0000292 -0.0000924 0.0000915 -0.1211073 -0.1210355 -0.2115476 -0.0000045 -0.8060098 1.0316277 0.0000254 0.0000812 0.0003592 -0.1799392 -0.5588612 0.1471958 0.0000236 0.2675343 0.0946956 -0.0000051 0.0000318 0.0001094 -0.1354342 0.1693783 -0.070913 -0.0000019 -0.0776922 -0.1057305 -0.0000036 -0.0000286 -0.0001754 -0.0668001 -1.350166 -0.0791025 0.0001324 -0.1118612 0.0458727 0.0000123 0.0000727 0.0000168 0.0561272 1.1996699 -0.3801752 -0.0000346 -0.6194885 -0.2786514 0.0000273 0.0000326 0.0001666 0.1672427 0.3375684 -0.0722721 -0.0000156 0.2786976 -0.0444758 -0.0000275 -0.0000957 0.0000278 -0.1106123 0.3112779 0.4971207 -0.0000263 1.3427185 0.6216415 -0.0000133 -0.0000174 0.0000307 -0.1705288 0.0079538 0.0075146 -0.0004086 -0.0026448 0.0495146 -0.0705991 0.0034547 -0.094244 0.0201319 0.0079447 0.0074254 0.0004088 -0.0026253 0.0494041 0.0705961 -0.0035219 0.0940817 0.0201413 0.1164025 -0.0279452 -0.0000057 -0.0050063 0.0446427 -0.0000064 -0.0000083 -0.0000081 0.1667417 0.060025 -0.0804409 0.0000067 -0.0537835 -0.0392939 -0.0000025 0.0000122 -0.000069 0.1504899 0.1082836 0.0549703 -0.000002 0.0253276 -0.0106948 0.0000074 0.0000106 0.0000585 0.1544348 0.0719284 0.0640421 0.0000003 0.0174343 0.0755859 -0.0000005 -0.0000043 -0.0000217 0.1705242 0.4813312 -0.0408335 0.0000096 -0.0951516 0.205728 0.0000171 -0.0000095 0.0000337 0.3651026 unknown
polarizability: 381.5354764|6.6938722|229.7669523|-0.0147322|0.0012335|69.1696031 unknown
InChI: InChI=1S/C13H7Br2NO3/c14-11-5-9-8-2-1-7(16(18)19)3-6(8)4-10(9)12(15)13(11)17/h1-3,5,17H,4H2
charge 0 multiplicity 1
26 atoms
Br -3.263943 3.064764 0.000228
Br -4.632201 -2.580881 0.000181
O  -5.049057 0.442952 0.000248
O  5.514022 -0.954975 -0.000469
O  5.169324 1.300973 -0.000334
N  4.739465 0.08053 0.000094
C  -0.103149 1.757324 0.000176
C  1.041531 0.752797 0.000153
C  -1.329191 0.860994 0.000188
C  0.524959 -0.582817 0.000147
C  -0.942641 -0.514811 0.00016
C  2.420583 0.987993 0.00014
C  -2.687649 1.185381 0.000215
C  1.399642 -1.694261 0.000118
C  -1.912552 -1.541321 0.000154
C  3.277213 -0.140918 0.00012
C  -3.691167 0.173223 0.000216
C  2.789614 -1.470177 0.000096
C  -3.273459 -1.18916 0.000175
H  -0.079108 2.420751 0.886505
H  -0.07913 2.420762 -0.886146
H  2.854359 1.991435 0.00015
H  1.012391 -2.718066 0.000107
H  -1.625375 -2.596155 0.000132
H  3.506428 -2.295179 0.000067
H  -5.212109 1.424942 0.000178
