program: Gaussian 09
title: 000052303
version: EM64L-G09RevD.01
frameworkgroup: C1[X(C10H24N2S2)]
method: RPBEPBE
basis: SDD
operation: Freq
keyword: #p
keyword: freq=noraman
keyword: PBEPBE/SDD
title: #p freq=noraman PBEPBE/SDD
converged: YES YES NO NO
title: Mulliken charges:
elementType: S S N N C C C C C C C C C C H H H H H H H H H H H H H H H H H H H H H H H H
charge: 0.131979 0.130797 -0.052423 -0.049105 -0.335704 -0.347141 -0.640797 -0.638469 -0.614528 -0.616269 -0.580978 -0.609502 -0.648391 -0.627622 0.201675 0.204712 0.206632 0.205466 0.244125 0.250726 0.248848 0.245181 0.200436 0.219512 0.250052 0.217476 0.206059 0.251047 0.265683 0.244243 0.262506 0.246794 0.224947 0.228526 0.213283 0.232888 0.216590 0.210744
chargesum: 0.00000
title: Mulliken charges with hydrogens summed into heavy atoms:
elementType: S S N N C C C C C C C C C C
charge: 0.131979 0.130797 -0.052423 -0.049105 0.070683 0.064957 -0.145946 -0.144439 0.055472 0.058313 -0.071052 -0.100202 0.018365 0.032600
polarizability: 2.02031475e+02 -1.16945359e+01 1.63145932e+02 5.94991091e+00 -8.25625459e+00 1.23885245e+02
1716.lowfreq: -19.0232 -12.3421 -8.0181 -4.8365 0.0016 0.0017 0.0020 9.4851 17.8332
frequency: -11.5836 4.2353 17.3543 31.4429 36.8890 51.6111 62.3784 92.4323 107.6333 132.6494 150.2901 160.9178 172.3610 179.9140 189.5576 227.9556 235.6707 244.1111 273.9065 299.1302 310.6359 329.6537 359.3503 363.1330 393.4455 436.9389 509.8641 608.4814 619.2017 641.9807 659.8918 751.1892 773.6592 788.5358 809.6101 842.6210 903.6444 908.4337 981.1966 993.8376 1032.1801 1033.3535 1036.0504 1041.0973 1048.1472 1057.0872 1060.2303 1069.7049 1108.8630 1111.4399 1124.3230 1150.2643 1163.4145 1237.1228 1246.1990 1250.4766 1259.0952 1262.9016 1274.5579 1278.6051 1284.4865 1303.8919 1315.2738 1324.0676 1340.7458 1371.9659 1387.0811 1392.1661 1428.9553 1429.3636 1438.7017 1444.4277 1446.1135 1460.6394 1465.6639 1467.2040 1468.5462 1472.2995 1475.8991 1478.2035 1479.2378 1480.9131 1483.3238 1484.0905 2884.8123 2892.1539 2893.5805 2917.4893 2934.5517 2945.5897 2973.1803 2980.7827 2996.2179 3005.4606 3021.8959 3028.0958 3031.0171 3045.3614 3058.8151 3062.8483 3072.0796 3072.6018 3075.1902 3078.9272 3082.3564 3084.1134 3095.2873 3097.4468
redmass: 3.8976 4.0638 4.1614 2.5870 3.7928 2.8151 2.4014 2.2524 1.8534 2.8625 2.6977 2.5258 1.8277 1.1223 1.3704 1.9983 1.7482 1.4858 2.7347 3.0119 3.2790 2.8420 2.6065 2.3183 2.8276 2.6832 3.7268 4.3925 4.1848 5.5179 5.1586 1.1695 1.2216 1.1147 4.6142 4.1629 1.5698 1.5992 1.7488 1.7669 1.9739 1.5136 1.8014 1.6116 1.6719 1.9063 2.3287 2.1752 1.2592 1.3507 2.0104 1.6017 1.2764 1.2343 1.4749 1.3833 1.2291 1.2860 1.1643 1.1724 1.4250 1.8564 1.7874 1.5505 1.7283 1.3355 1.2107 1.2067 1.1417 1.1419 1.0810 1.0861 1.0901 1.0911 1.0935 1.0521 1.0413 1.0682 1.0517 1.0611 1.0691 1.0496 1.0465 1.0581 1.0561 1.0652 1.0540 1.0680 1.0673 1.0676 1.0367 1.0357 1.0569 1.0611 1.0879 1.0780 1.0772 1.0942 1.0986 1.1055 1.0962 1.0984 1.0991 1.0975 1.0997 1.1008 1.1028 1.1024
irintensity: 0.3080 0.7724 0.0644 0.7462 2.1765 1.2174 0.0608 4.2540 1.2157 6.8318 0.5953 0.5001 0.8603 4.5669 0.2480 0.0059 0.1715 0.1310 1.6665 10.8619 10.9354 2.4339 3.3290 6.3178 28.3908 0.3457 0.1260 5.3825 0.7350 18.2642 70.3270 19.5665 18.0330 10.7257 14.7045 0.9298 2.1023 20.4095 17.7731 18.2161 23.0342 5.7524 39.8906 159.4970 61.7243 7.0882 1.8314 2.1086 4.4050 4.8664 71.1053 0.9310 82.0949 5.6116 6.2579 1.7050 28.5725 15.1122 27.1237 16.5954 27.6798 11.4886 37.0516 14.5539 34.4843 0.6529 14.2590 16.4789 27.6137 10.2033 1.4678 0.5025 7.1030 3.2772 3.6783 12.9789 11.4654 6.8832 9.6340 12.5481 24.6338 23.4323 9.2799 8.6994 72.5519 129.3224 69.4716 153.3891 90.0985 82.3023 32.3592 38.8397 24.3307 17.5279 0.5019 31.8973 20.0211 46.5286 33.9841 7.0574 14.5661 33.3302 12.2337 18.9073 30.9742 21.2456 43.8483 38.5173
temp: 298.150 k
press: 1.00000 atm
elementType: 16 16 7 7 6 6 6 6 6 6 6 6 6 6 1 1 1 1 1 1 1 1 1 1 1 1 1 1 1 1 1 1 1 1 1 1 1 1
symmnumber: 1
zpe: 867017.3 jmol-1
zpe.correction: 0.330229 hartree
zpe.thermalcorrener: 0.349937 hartree
zpe.thermalcorrenthalpy: 0.350881 hartree
zpe.thermalcorrgfe: 0.277068 hartree
zpe.sumelectzpe: -1299.853852 hartree
zpe.sumelectthermal: -1299.834145 hartree
zpe.sumelectthermalent: -1299.833201 hartree
zpe.sumelectthermalfe: -1299.907014 hartree
dipole: 0.2353 -0.2076 0.2155
dipole: 0.3807
quadrupole: -132.8158 -98.9254 -102.2292
quadrupole: -9.5307 1.6543 -0.5031
quadrupole: -21.4923 12.3980 9.0943 -9.5307 1.6543 -0.5031
hfenergy: -1300.1840814 hartree
pointgroup: C01 [X(C10H24N2S2)]
dipole: -0.100779 0.0630933 0.0910666 debye
polarizability: 203.8363337|-8.3777218|158.9590831|-5.2608575|12.3519896|126.2672361 unknown
InChI: InChI=1S/C10H24N2S2/c1-5-13-9-11(3)7-8-12(4)10-14-6-2/h5-10H2,1-4H3
charge 0 multiplicity 1
38 atoms
S  -4.239927 -0.935827 -0.728675
S  4.460104 0.887018 0.24527
N  -1.443648 -1.00821 -0.275242
N  1.632324 1.212879 0.170107
C  -0.15588 -0.370859 -0.615572
C  0.380836 0.524206 0.534452
C  -2.425343 -1.155344 -1.333193
C  2.742438 1.203521 1.090008
C  -1.368298 -2.148413 0.652898
C  1.503601 2.419523 -0.658884
C  -4.09253 0.825291 -0.042203
C  4.056754 -0.748265 -0.614401
C  -5.199586 1.086236 0.990168
C  4.074376 -1.960787 0.329142
H  0.630665 -1.120539 -0.871596
H  -0.304001 0.256991 -1.51423
H  -0.421678 1.245861 0.811934
H  0.569896 -0.100586 1.427064
H  -2.457677 -2.164032 -1.799815
H  -2.244781 -0.402424 -2.117731
H  2.599574 0.419707 1.850749
H  2.928826 2.173278 1.598503
H  -0.860391 -3.03594 0.203565
H  -0.82405 -1.86951 1.571572
H  -2.393593 -2.438773 0.942322
H  0.824648 2.236371 -1.509995
H  1.113228 3.29504 -0.087381
H  2.495515 2.681931 -1.068079
H  -3.088048 0.879827 0.415658
H  -4.152849 1.534426 -0.886552
H  3.065099 -0.603677 -1.08146
H  4.8112 -0.842174 -1.41407
H  -6.204697 0.976845 0.544367
H  -5.121998 0.380943 1.836188
H  -5.116224 2.115621 1.387629
H  5.063756 -2.080303 0.803779
H  3.323996 -1.852502 1.133688
H  3.840561 -2.890449 -0.226184
