program: Gaussian 09
title: 000052317
version: EM64L-G09RevD.01
frameworkgroup: C1[X(C11H15Cl2NO)]
method: RPBEPBE
basis: SDD
operation: Freq
keyword: #p
keyword: freq=noraman
keyword: PBEPBE/SDD
title: #p freq=noraman PBEPBE/SDD
converged: YES YES NO NO
title: Mulliken charges:
elementType: Cl Cl O N C C C C C C C C C C C H H H H H H H H H H H H H H H
charge: -0.055656 -0.051586 -0.275342 -0.329570 -0.457241 -0.375445 0.515909 -0.263764 -0.301050 -0.382604 -0.205349 -0.222114 -0.222341 -0.092812 -0.676171 0.226778 0.205628 0.225540 0.240671 0.253195 0.173129 0.204335 0.292986 0.188104 0.185534 0.281589 0.257754 0.202513 0.228331 0.229047
chargesum: 0.00000
title: Mulliken charges with hydrogens summed into heavy atoms:
elementType: Cl Cl O N C C C C C C C C C C C
charge: -0.055656 -0.051586 -0.275342 -0.076375 0.008970 0.056961 0.515909 0.113699 -0.301050 -0.089618 0.168289 0.059475 0.035413 -0.092812 -0.016279
polarizability: 2.11088326e+02 -1.29950838e+01 1.57978554e+02 2.88719066e+00 4.34022607e-02 8.29084615e+01
1716.lowfreq: -6.5262 -0.0019 -0.0018 -0.0007 1.9278 4.2395 19.5091 32.1206 46.5496
frequency: 19.4074 32.0674 46.3160 59.7063 93.1425 104.2303 119.7711 128.5672 153.8868 161.6391 165.9615 202.4522 237.7434 238.3455 298.2345 341.0170 362.6697 381.5324 429.6894 442.7871 473.1950 526.3052 547.1183 640.9453 682.5558 709.0392 720.6170 811.5866 815.3753 827.3041 834.0073 842.2801 862.0575 954.2901 986.9549 999.0395 1019.1363 1035.6022 1071.1544 1077.8412 1082.0499 1119.6270 1127.3625 1129.6151 1142.0188 1151.8028 1175.6793 1206.4714 1239.4256 1249.7148 1252.5503 1269.8468 1302.0175 1332.4650 1360.6448 1377.0864 1384.6675 1393.9162 1413.6276 1450.8328 1453.8792 1459.5639 1471.1858 1475.1595 1483.5304 1493.4086 1497.8610 1568.2390 1594.8337 2901.1644 2905.2126 2910.3731 2917.8421 2962.8855 2974.4992 2990.7956 2994.4313 3039.0897 3092.2550 3101.2282 3148.0900 3173.8563 3182.9433 3422.1332
redmass: 4.9391 5.4653 1.8959 3.6073 2.0237 3.7074 4.0212 2.4869 9.5191 3.7847 4.6649 7.2614 1.8608 1.8629 4.3823 4.3700 9.4197 6.7135 4.2425 3.1852 3.9467 4.5867 4.5610 6.6131 2.8480 6.1125 1.4323 2.0780 1.4308 1.2433 1.2629 2.6373 1.4078 1.6209 1.8719 2.5034 3.7536 2.3454 3.5656 2.2603 3.5446 1.5762 1.5579 2.3373 1.6323 2.5699 1.1555 2.2102 1.3967 1.2912 1.1809 1.1294 1.2842 1.5922 1.7730 3.5619 1.8657 1.3138 1.5160 2.3083 1.2269 1.0409 1.1589 1.0825 1.0562 1.0821 1.0822 8.0686 7.3934 1.0611 1.0687 1.0697 1.0561 1.1064 1.0965 1.0888 1.0359 1.0929 1.0991 1.1009 1.0891 1.0959 1.0938 1.0740
irintensity: 0.1841 0.2203 1.2579 3.6312 2.3703 2.1444 3.5838 2.6400 1.0435 3.4460 1.7729 0.3557 0.9898 0.3479 3.0950 0.9833 8.3346 2.6276 8.4280 10.5125 7.5514 1.0559 5.6342 8.5776 2.9488 43.3675 102.9010 15.2395 9.2075 20.2291 25.5190 4.0475 19.3159 9.8714 8.6452 6.4670 66.7084 6.1701 101.8860 31.5020 56.7033 0.1646 0.6342 36.5330 25.9464 57.9729 4.8867 7.4285 5.3408 2.0427 1.2881 4.0681 20.3899 13.7371 3.8179 10.2423 6.3928 36.7959 0.8902 125.1623 37.3343 11.1005 2.5211 6.7976 3.2749 2.7732 7.0550 36.3021 28.7998 53.4644 21.9272 90.7156 94.6774 69.7964 56.1746 15.0212 25.5861 41.7286 36.2596 38.3660 1.6436 3.5042 0.5207 0.6926
temp: 298.150 k
press: 1.00000 atm
elementType: 17 17 8 7 6 6 6 6 6 6 6 6 6 6 6 1 1 1 1 1 1 1 1 1 1 1 1 1 1 1
symmnumber: 1
zpe: 627031.3 jmol-1
zpe.correction: 0.238824 hartree
zpe.thermalcorrener: 0.255511 hartree
zpe.thermalcorrenthalpy: 0.256455 hartree
zpe.thermalcorrgfe: 0.191276 hartree
zpe.sumelectzpe: -1477.083776 hartree
zpe.sumelectthermal: -1477.067089 hartree
zpe.sumelectthermalent: -1477.066144 hartree
zpe.sumelectthermalfe: -1477.131323 hartree
dipole: -2.7666 -1.5482 0.8448
dipole: 3.2810
quadrupole: -106.6302 -103.5519 -104.1396
quadrupole: 9.0835 -2.4366 -0.5862
quadrupole: -1.8563 1.2220 0.6343 9.0835 -2.4366 -0.5862
hfenergy: -1477.3225994 hartree
pointgroup: C01 [X(C11H15Cl2N1O1)]
dipole: -1.0677336 -0.2958184 0.6623189 debye
polarizability: 211.8287136|-7.9334929|129.4651409|8.4513748|-35.9999128|110.6814865 unknown
InChI: InChI=1S/C11H15Cl2NO/c1-2-15-6-5-14-8-9-3-4-10(12)7-11(9)13/h3-4,7,14H,2,5-6,8H2,1H3
charge 0 multiplicity 1
30 atoms
Cl 2.542896 2.39798 -1.96016
Cl 5.740991 -1.198764 0.788242
O  -4.662092 -0.07774 -0.070459
N  -0.949866 0.186913 0.029027
C  0.098734 0.724337 -0.861714
C  -2.331326 0.369767 -0.469835
C  1.492958 0.262917 -0.451519
C  -3.321057 -0.367058 0.440269
C  2.668314 0.926051 -0.875525
C  1.667927 -0.880571 0.369635
C  -5.716196 -0.770446 0.684762
C  3.964248 0.505714 -0.517658
C  2.946531 -1.338293 0.754091
C  4.077686 -0.632383 0.303097
C  -7.05724 -0.38922 0.05913
H  -2.396747 -0.058958 -1.486898
H  -2.645253 1.437504 -0.544383
H  0.091711 1.836944 -0.934023
H  -0.113113 0.357733 -1.886831
H  -0.844168 0.551016 0.987299
H  -3.226126 -0.012713 1.494335
H  -3.114679 -1.459037 0.424726
H  0.762388 -1.405305 0.690578
H  -5.551068 -1.870401 0.636736
H  -5.674119 -0.465571 1.75502
H  4.847833 1.045366 -0.866198
H  3.059502 -2.223409 1.386088
H  -7.888309 -0.887664 0.590633
H  -7.210673 0.702423 0.111423
H  -7.086787 -0.691431 -1.001889
