program: Gaussian 09
title: 000052300
version: EM64L-G09RevD.01
frameworkgroup: C1[X(C17H22BrN3)]
method: RPBEPBE
basis: SDD
operation: Freq
keyword: #p
keyword: freq=noraman
keyword: PBEPBE/SDD
title: #p freq=noraman PBEPBE/SDD
converged: YES YES NO NO
title: Mulliken charges:
elementType: Br N N N C C C C C C C C C C C C C C C C C H H H H H H H H H H H H H H H H H H H H H H
charge: -0.009810 -0.145491 -0.073525 -0.109940 -0.425033 -0.364506 -0.572551 -0.298276 0.243954 0.528599 -0.633273 -0.700305 -0.317150 -0.411979 -0.367404 -0.181655 -0.216471 -0.191762 -0.211581 -0.363869 -0.215797 0.235542 0.239042 0.187049 0.237915 0.216072 0.285542 0.176081 0.210991 0.227654 0.236605 0.187031 0.228776 0.215833 0.213388 0.244015 0.253230 0.265013 0.232984 0.231160 0.251441 0.233869 0.228595
chargesum: 0.00000
title: Mulliken charges with hydrogens summed into heavy atoms:
elementType: Br N N N C C C C C C C C C C C C C C C C C
charge: -0.009810 -0.145491 -0.073525 -0.109940 0.049551 0.060457 -0.070936 0.088795 0.243954 0.528599 0.018016 -0.042308 -0.073135 -0.158749 -0.102390 -0.181655 0.016513 0.039397 0.039860 -0.130001 0.012798
polarizability: 2.88881500e+02 4.96641934e+01 2.43417274e+02 -4.98071122e+00 -1.08479470e+01 1.48056695e+02
1716.lowfreq: -15.0810 -7.1624 -0.0005 0.0004 0.0006 3.4498 3.5203 10.2711 17.5764
frequency: -14.0026 9.8878 17.5736 30.6826 38.5427 55.4901 73.5041 107.8867 117.6696 126.0907 156.1514 158.0611 185.3317 199.3158 211.2542 255.8975 259.4100 288.0421 313.6078 331.4767 348.3676 351.1570 389.2051 410.0755 417.4650 430.7233 476.2125 496.7887 519.3759 534.8650 580.8849 613.7384 632.3591 657.0960 699.6436 732.9941 757.0517 769.1391 780.5194 791.8768 800.8291 806.0367 827.0509 851.4667 886.9467 912.1373 943.9741 945.2272 946.2900 947.6976 978.1021 981.1307 984.3701 1003.8525 1032.4008 1040.5886 1046.8282 1063.9868 1073.2658 1087.4524 1090.4025 1095.0272 1100.9813 1128.5673 1158.6861 1173.9305 1177.6140 1196.7210 1207.1419 1220.0319 1242.9920 1253.0929 1286.2501 1293.3980 1300.7327 1307.8158 1323.3172 1335.8137 1347.5811 1353.2990 1375.3583 1383.3397 1391.3392 1395.4811 1416.3416 1426.4235 1433.9878 1453.6118 1460.1101 1464.5949 1465.9314 1471.8825 1475.1698 1479.6632 1490.9685 1494.6850 1501.9964 1550.0251 1570.3839 1596.9287 1602.6862 2834.6439 2845.0335 2859.2014 2979.4764 2987.2364 3008.6747 3015.0828 3029.3916 3045.4541 3052.9832 3068.4728 3081.2244 3090.6774 3097.7290 3121.1696 3135.4556 3136.6904 3143.1740 3156.4219 3165.2963 3174.3040 3177.3554
redmass: 2.9344 6.5780 4.8773 3.6471 4.2845 3.7465 2.4293 3.3152 4.7732 3.5855 3.6388 5.0467 1.8106 1.6037 3.7008 1.7004 2.4437 5.8378 2.7807 3.6499 3.2641 2.3957 2.2293 2.9693 3.2507 3.0076 2.9018 3.5523 3.1735 4.8782 3.8787 6.7544 5.5339 6.1835 2.4300 1.7489 3.2578 2.4796 1.6194 1.6621 1.4261 1.4063 4.1374 1.3559 1.4942 1.3706 1.5502 3.8607 2.2988 2.7727 1.3351 4.6320 1.4255 2.3428 2.9366 2.2644 1.9261 2.2547 2.4031 1.7770 1.7627 1.4923 1.5895 1.7951 1.9989 1.1237 1.0862 2.4105 2.5269 1.9356 1.5231 1.5526 1.1757 1.3318 1.3772 1.3826 1.5430 3.4791 1.4065 1.3662 5.6796 1.2614 1.9640 1.3555 2.4110 1.9475 1.1952 1.3892 1.1210 1.6445 1.0894 1.0977 1.1764 1.4070 1.1097 1.0565 1.3458 5.3922 6.4042 5.9079 6.5398 1.0709 1.0676 1.0613 1.0633 1.0356 1.0605 1.0878 1.0861 1.0719 1.0976 1.1035 1.0988 1.1006 1.0997 1.0893 1.0888 1.0870 1.0921 1.0942 1.0932 1.0977 1.1002
irintensity: 0.2647 0.2837 0.4597 0.0677 0.1275 1.2617 0.3826 0.1880 1.6581 1.3975 2.1418 0.4896 0.7432 0.4848 1.3394 0.6074 3.6826 6.0918 1.2288 0.6319 11.0411 8.1773 10.2231 7.1212 0.0772 3.8916 0.9974 7.3359 2.1141 6.7328 10.8689 1.6652 0.9712 28.4924 32.0338 27.1140 8.1606 62.6898 4.9703 45.8208 1.8745 13.9080 27.6293 0.3169 12.1816 5.7558 8.5307 0.7607 48.5990 34.9809 0.5195 6.0052 0.2015 11.9162 5.1524 15.6818 53.9703 22.0316 3.1740 6.4616 0.7718 1.7054 16.9640 8.0827 39.6922 12.4278 1.3450 48.9021 8.0746 5.4027 76.7853 14.5251 8.7531 4.4996 36.9329 0.4184 9.1172 40.1914 7.2951 11.3636 9.9836 10.8432 3.9318 19.2218 81.7591 16.6262 3.0077 48.6450 13.9166 19.0094 4.6296 6.1899 51.9379 114.7060 19.5993 6.9659 79.0538 27.9161 57.2564 376.5092 18.8171 57.6429 64.3953 187.8495 56.9600 31.3293 19.9336 13.9469 28.2510 33.1610 31.1700 20.3823 54.5610 32.5753 39.4116 28.7159 11.2813 5.0219 5.3257 5.3419 26.2863 8.4624 17.3250
temp: 298.150 k
press: 1.00000 atm
elementType: 35 7 7 7 6 6 6 6 6 6 6 6 6 6 6 6 6 6 6 6 6 1 1 1 1 1 1 1 1 1 1 1 1 1 1 1 1 1 1 1 1 1 1
symmnumber: 1
zpe: 934190.8 jmol-1
zpe.correction: 0.355814 hartree
zpe.thermalcorrener: 0.376347 hartree
zpe.thermalcorrenthalpy: 0.377291 hartree
zpe.thermalcorrgfe: 0.302302 hartree
zpe.sumelectzpe: -837.133415 hartree
zpe.sumelectthermal: -837.112883 hartree
zpe.sumelectthermalent: -837.111939 hartree
zpe.sumelectthermalfe: -837.186928 hartree
dipole: -2.7009 0.9708 0.5034
dipole: 2.9139
quadrupole: -135.4414 -128.0625 -136.0101
quadrupole: -2.8363 1.8793 -6.7586
quadrupole: -2.2700 5.1089 -2.8388 -2.8363 1.8793 -6.7586
hfenergy: -837.4892299 hartree
pointgroup: C01 [X(C17H22Br1N3)]
dipole: 1.0676289 0.3068615 0.2833538 debye
polarizability: 225.774237|35.8065916|305.1708124|4.3113373|20.189189|149.4104193 unknown
InChI: InChI=1S/C17H22BrN3/c1-3-20(2)11-12-21(17-9-4-5-10-19-17)14-15-7-6-8-16(18)13-15/h4-10,13H,3,11-12,14H2,1-2H3
charge 0 multiplicity 1
43 atoms
Br -3.957708 -4.308874 -0.808802
N  0.230966 0.604025 -0.416906
N  3.240648 -1.667416 0.210892
N  -0.412444 2.831586 -0.85533
C  1.055288 -0.419761 0.245886
C  2.369455 -0.719408 -0.522947
C  -0.818539 0.138565 -1.349383
C  4.658987 -1.577873 -0.232552
C  0.453636 1.967805 -0.223411
C  -1.99136 -0.538133 -0.644141
C  2.720817 -3.052521 0.173282
C  5.637695 -2.314488 0.700702
C  1.523213 2.460568 0.59686
C  -2.364472 -1.862347 -0.983248
C  -2.729397 0.157081 0.348496
C  -3.461314 -2.462378 -0.331543
C  -3.823611 -0.461611 0.987331
C  1.66737 3.849152 0.757089
C  -4.204252 -1.785132 0.653722
C  -0.240085 4.170197 -0.689514
C  0.776075 4.73963 0.106524
H  1.308227 -0.11466 1.277036
H  0.439035 -1.332205 0.333016
H  2.116825 -1.081603 -1.553518
H  2.921888 0.230426 -0.64649
H  -0.371694 -0.559975 -2.084389
H  -1.171314 1.035547 -1.887947
H  4.785494 -1.959604 -1.279801
H  4.927255 -0.504368 -0.250057
H  1.690867 -3.087329 0.566392
H  3.334662 -3.706134 0.814216
H  2.713916 -3.482867 -0.861132
H  5.489939 -1.984224 1.744136
H  5.512162 -3.411032 0.662149
H  6.679654 -2.091703 0.406456
H  2.221667 1.780179 1.090262
H  -1.806101 -2.41337 -1.74783
H  -2.441228 1.181629 0.60683
H  -4.394921 0.080252 1.748941
H  2.478389 4.237091 1.38367
H  -5.051713 -2.267937 1.148377
H  -0.959428 4.804905 -1.221234
H  0.865951 5.824312 0.209609
