program: Gaussian 09
title: 000052272
version: EM64L-G09RevD.01
frameworkgroup: C1[X(C14H12N2O3)]
method: RPBEPBE
basis: SDD
operation: Freq
keyword: #p
keyword: freq=noraman
keyword: PBEPBE/SDD
title: #p freq=noraman PBEPBE/SDD
converged: NO YES NO YES
title: Mulliken charges:
elementType: O O O N N C C C C C C C C C C C C C C H H H H H H H H H H H H
charge: -0.283746 -0.435463 -0.259826 -0.511645 -0.503332 0.502079 -0.591165 0.296543 0.477784 -0.332959 -0.356627 -0.198655 0.278090 -0.447901 -0.333008 -0.197006 -0.213751 -0.257343 0.111148 0.260333 0.297271 0.313404 0.274768 0.290784 0.232363 0.214372 0.305687 0.226610 0.226676 0.229795 0.384724
chargesum: 0.00000
title: Mulliken charges with hydrogens summed into heavy atoms:
elementType: O O O N N C C C C C C C C C C C C C C
charge: -0.283746 -0.050739 -0.259826 -0.214374 -0.212548 0.502079 -0.330832 0.296543 0.477784 -0.019555 -0.081859 0.033708 0.278090 -0.233529 -0.027322 0.029603 0.012925 -0.027549 0.111148
polarizability: 3.27197352e+02 2.23011312e+00 1.84705510e+02 -5.84417649e-03 -3.20852480e-04 6.78717386e+01
1716.lowfreq: -10.9767 -4.2390 -3.3842 -0.0012 -0.0007 0.0002 14.9672 28.4198 59.8876
frequency: 13.4718 28.2464 59.8837 60.4256 71.0467 82.8034 137.4110 159.9557 211.9954 228.1657 233.1289 233.7435 321.7560 352.9012 393.0696 406.4229 422.1804 442.7447 490.5793 513.8545 525.3231 536.2612 594.8208 611.2021 613.4314 624.4384 635.8568 691.4809 695.4709 698.0992 715.4710 732.8715 766.0439 774.4241 826.3350 832.3510 838.2561 898.6699 913.5933 919.3908 947.7068 970.8482 982.4669 984.6888 998.2346 1002.7990 1007.6204 1028.7272 1057.1400 1090.6172 1091.4849 1140.6322 1172.4777 1178.5582 1186.7330 1188.7164 1245.1203 1269.1767 1311.7808 1318.8093 1331.0878 1380.1939 1388.6669 1420.5383 1431.7696 1477.7122 1487.5594 1513.6764 1525.1931 1593.6211 1601.7381 1616.5277 1619.4010 1638.4175 1654.5132 3103.1251 3126.3159 3132.6282 3144.3499 3146.4552 3166.3729 3185.5369 3197.9478 3200.0818 3519.2380 3527.6790 3531.8904
redmass: 4.3443 5.9756 6.3202 7.7574 7.3771 4.8452 7.0912 4.8047 6.9004 2.8825 3.7160 5.9303 7.6618 6.5173 8.2617 2.9266 3.0400 1.5688 6.7397 2.7442 7.0781 2.3817 4.7429 1.2995 6.4312 1.2867 6.7797 2.4946 2.0379 9.6155 6.2464 3.7306 1.6895 6.9280 1.4576 5.9766 1.2734 5.6353 1.4288 1.6132 1.3817 1.3520 6.0913 6.1745 1.3049 6.1457 1.3315 2.1765 2.5267 1.5710 1.6526 1.5457 1.0519 1.8415 1.3106 1.1124 1.9747 1.8546 1.5755 1.4778 2.9997 4.0290 6.8309 3.7015 2.5356 2.7338 2.4766 2.0825 2.1122 5.6774 5.4235 6.0008 6.2990 8.3072 3.9350 1.0891 1.0917 1.0866 1.0932 1.0893 1.0999 1.0945 1.0955 1.0946 1.0766 1.0641 1.0757
irintensity: 1.1056 0.6138 0.6606 0.0001 11.9570 0.0004 4.2309 2.2135 1.2753 0.7200 3.1685 8.6536 0.2748 4.3644 13.9161 0.0105 5.1395 4.0045 19.3344 12.2889 9.4985 17.5349 51.6196 239.0143 1.7435 18.8629 1.3474 0.0237 53.9638 11.1369 7.5788 91.4216 101.3477 0.9660 31.1650 10.1108 0.0097 15.4220 9.4920 41.3219 0.0250 0.1945 1.8082 5.7799 2.7379 129.8684 3.1978 9.9453 234.3025 6.8925 21.2203 173.1007 0.4846 181.6157 42.0359 6.8228 181.0421 49.7875 32.1240 149.9872 214.5775 25.9656 146.6158 22.3962 93.7090 473.1502 6.0965 820.9392 165.7432 46.5076 61.2860 76.1271 32.2305 250.8548 96.2652 18.8611 9.5290 0.3045 29.0250 13.2167 27.6740 2.5430 10.2482 7.1989 7.5002 51.4597 16.8065
temp: 298.150 k
press: 1.00000 atm
elementType: 8 8 8 7 7 6 6 6 6 6 6 6 6 6 6 6 6 6 6 1 1 1 1 1 1 1 1 1 1 1 1
symmnumber: 1
zpe: 616939.0 jmol-1
zpe.correction: 0.234980 hartree
zpe.thermalcorrener: 0.251400 hartree
zpe.thermalcorrenthalpy: 0.252344 hartree
zpe.thermalcorrgfe: 0.188197 hartree
zpe.sumelectzpe: -874.571762 hartree
zpe.sumelectthermal: -874.555341 hartree
zpe.sumelectthermalent: -874.554397 hartree
zpe.sumelectthermalfe: -874.618544 hartree
dipole: -0.4602 -2.0156 0.0009
dipole: 2.0675
quadrupole: -94.7182 -104.1472 -116.5853
quadrupole: 10.8600 -0.0032 -0.0013
quadrupole: 10.4320 1.0030 -11.4350 10.8600 -0.0032 -0.0013
hfenergy: -874.8067412 hartree
pointgroup: C01 [X(C14H12N2O3)]
dipole: 0.1852032 -0.7920346 -0.0003504 debye
polarizability: 327.2168319|-1.4823175|184.6860297|-0.0058458|0.0002902|67.8717386 unknown
InChI: InChI=1S/C14H12N2O3/c17-13(18)10-5-4-8-12(9-10)16-14(19)15-11-6-2-1-3-7-11/h1-9,15-17H
charge 0 multiplicity 1
31 atoms
O  1.185842 1.504839 0.000152
O  -6.33452 -0.402502 0.000768
O  -4.98714 -2.291124 0.00053
N  -0.232806 -0.380856 -0.000225
N  2.080633 -0.678577 -0.000208
C  -1.511529 0.238609 -0.000223
C  -2.641642 -0.61596 -0.000163
C  -3.94901 -0.077272 -0.000234
C  3.480866 -0.412716 -0.000111
C  -1.705073 1.649106 -0.000319
C  -4.146559 1.327044 -0.00031
C  -3.016828 2.170289 -0.00036
C  1.028129 0.250289 0.000007
C  4.348338 -1.539917 -0.000268
C  4.032583 0.89646 0.000101
C  5.746142 -1.364263 -0.000206
C  5.435457 1.053363 0.000159
C  6.30156 -0.063454 0.00001
C  -5.08432 -1.037988 -0.000246
H  -2.534069 -1.70817 -0.000097
H  -0.257645 -1.402736 -0.000324
H  -0.833597 2.305584 -0.000328
H  -5.162183 1.729736 -0.000354
H  1.840472 -1.672271 -0.000466
H  -3.151191 3.257286 -0.000443
H  3.928325 -2.554959 -0.000431
H  3.364993 1.759174 0.000221
H  6.399537 -2.243726 -0.000328
H  5.852345 2.066842 0.000324
H  7.387701 0.074889 0.000054
H  -7.046111 -1.097718 0.001415
