program: Gaussian 09
title: 000052489
version: EM64L-G09RevD.01
frameworkgroup: C1[X(C31H16N2O2)]
method: RPBEPBE
basis: SDD
operation: Freq
keyword: #p
keyword: freq=noraman
keyword: PBEPBE/SDD
title: #p freq=noraman PBEPBE/SDD
converged: YES YES NO NO
title: Mulliken charges:
elementType: O O N N C C C C C C C C C C C C C C C C C C C C C C C C C C C C C C C H H H H H H H H H H H H H H H H
charge: -0.191862 -0.182607 -0.334791 -0.036017 0.149645 0.293210 -0.170038 0.035273 0.296127 -0.188050 0.287153 0.398144 0.273436 0.455830 0.507615 0.209343 -0.389570 0.225314 -0.411595 -0.475043 -0.351821 -0.292817 -0.450971 -0.415070 -0.440085 -0.362689 -0.192118 -0.426215 -0.422627 -0.241474 -0.400256 -0.241395 -0.243699 -0.227331 -0.237735 0.276363 0.248469 0.265970 0.282990 0.295957 0.249727 0.284581 0.233493 0.273283 0.295946 0.241756 0.294365 0.237308 0.240711 0.235857 0.238006
chargesum: 0.00000
title: Mulliken charges with hydrogens summed into heavy atoms:
elementType: O O N N C C C C C C C C C C C C C C C C C C C C C C C C C C C C C C C
charge: -0.191862 -0.182607 -0.334791 -0.036017 0.149645 0.293210 -0.170038 0.035273 0.296127 -0.188050 0.287153 0.398144 0.273436 0.455830 0.507615 0.209343 -0.113206 0.225314 -0.411595 -0.226575 -0.351821 -0.026847 -0.167981 -0.119113 -0.190358 -0.078108 0.041375 -0.152931 -0.126681 0.000282 -0.105891 -0.004087 -0.002988 0.008526 0.000271
polarizability: 6.34251299e+02 6.55590610e-02 3.95053256e+02 -4.06724808e+01 9.76049259e+00 2.13307258e+02
1716.lowfreq: -6.0084 -1.6227 -0.0006 0.0004 0.0006 4.8807 19.4679 30.7353 31.2081
frequency: 19.2149 30.6699 31.2078 61.8439 73.6355 88.7554 111.6930 121.9478 141.7110 143.1937 171.5130 199.0990 200.6626 222.9290 241.2750 249.7885 269.3084 277.7247 315.7590 331.0709 335.9899 361.3424 371.7360 378.5702 404.3622 413.4820 418.6409 431.3562 440.3836 448.7468 480.1585 498.2565 511.5785 515.5212 516.8090 532.3188 568.0408 582.0643 594.9088 601.0920 619.2157 629.9905 637.7941 646.3885 651.0118 659.0055 668.1914 688.4794 715.0143 720.0206 729.1654 750.4418 760.2050 767.6712 786.6469 791.7216 795.7677 797.5629 832.3979 837.7636 847.2667 868.3931 869.8572 873.7832 910.5011 912.9642 919.8609 935.6875 947.4813 954.4722 974.3812 985.0752 986.9568 987.3841 993.4836 1005.5200 1008.9805 1010.9263 1015.4865 1024.7469 1035.1741 1040.8599 1052.0600 1064.9020 1080.8608 1088.5885 1113.6733 1153.0570 1165.6320 1170.7784 1174.6078 1176.4115 1179.3679 1198.2237 1203.3118 1228.8156 1234.8154 1253.1362 1267.5693 1269.9620 1282.3212 1301.1440 1340.3908 1358.7561 1368.2879 1379.4021 1381.6927 1400.2935 1402.3322 1415.0537 1418.3722 1430.6773 1434.1774 1444.5154 1454.6311 1459.9079 1477.3335 1486.0814 1505.0185 1525.9546 1535.4328 1541.6389 1564.9589 1571.1928 1574.0349 1594.4411 1609.2214 1611.4133 1619.8571 1624.4734 1645.9786 3130.8309 3134.1046 3135.9784 3141.5678 3144.5506 3147.2919 3150.0034 3151.1814 3157.5969 3166.1381 3166.2704 3167.2959 3169.4036 3177.7394 3177.8511 3186.5338
redmass: 6.3151 7.1069 6.5681 6.5917 6.1550 5.1371 5.4132 4.8646 5.9108 5.8299 6.6562 4.3760 4.6340 6.2714 4.6194 5.6937 5.6218 5.5446 7.7023 5.9059 7.4519 6.5477 7.4911 6.8223 6.4235 4.7607 3.9005 7.6668 3.6155 6.2146 5.9711 6.2681 4.3778 3.8023 5.0158 4.1860 5.8360 5.2221 4.9431 5.5926 7.1631 5.9666 6.6540 6.0859 6.6053 5.9681 4.5991 6.2815 2.9495 3.7853 5.5357 3.1690 2.0945 5.8162 1.4743 1.5710 2.0406 1.6241 2.2063 4.4182 6.8831 2.0940 4.0864 2.6417 2.3735 3.1804 1.5586 5.9468 1.9807 1.4101 1.4302 6.4865 1.4174 1.3976 1.4043 1.3951 1.3809 1.3886 6.1277 4.1594 2.2678 2.7427 1.9944 2.8158 2.3801 2.4030 2.1871 1.3769 1.6444 1.5274 1.3089 1.1919 1.1044 2.2607 1.7558 2.9073 1.8636 2.3481 1.7139 1.7232 2.2086 3.4498 3.3350 4.4463 4.3037 6.2055 4.5764 4.7146 3.6643 6.4293 6.3816 2.4635 2.7029 2.9331 3.2558 3.0003 2.9182 3.6471 4.7579 7.1621 7.9054 9.6012 6.6389 7.0489 7.6604 6.1358 7.6270 7.2053 7.0172 7.4754 10.0008 1.0882 1.0858 1.0864 1.0898 1.0876 1.0898 1.0911 1.0910 1.0950 1.0939 1.0974 1.0987 1.1006 1.0975 1.0961 1.0949
irintensity: 0.5794 0.2372 0.6056 5.4503 3.7409 2.2022 0.3677 0.4974 0.2468 0.2121 1.0604 1.0401 2.7965 3.2278 0.4621 2.6487 3.9155 0.3512 9.0836 4.7799 7.2971 4.2247 5.7636 2.1628 0.8038 1.9324 0.2564 2.9567 2.4564 1.8413 6.7115 3.7786 1.8806 1.9264 1.2902 1.2168 3.7511 1.4556 16.8794 3.3320 16.2301 1.5473 3.2466 5.1780 1.6700 4.7597 6.7134 7.7203 46.7978 19.1677 9.3218 2.3607 3.3395 4.8383 36.8327 0.5181 51.2275 80.4721 45.8935 11.9729 11.4507 0.8834 15.7301 34.8376 11.7869 3.4097 0.8693 11.3283 1.0609 0.6087 0.4350 19.7944 4.3492 2.2352 3.2867 1.7781 3.5395 0.9322 182.4188 22.4166 12.6979 4.0054 8.8496 7.7714 0.7896 9.7787 3.5904 16.0122 15.9347 0.8308 2.1380 4.7541 1.0321 21.8564 3.8832 8.1951 8.1386 8.6438 2.8105 1.6185 131.3793 175.9257 44.3779 125.4117 59.4753 15.9847 6.5200 18.1878 21.5523 29.9531 23.8099 19.1597 2.3656 18.2491 26.0170 115.3969 27.9245 59.3708 24.4452 3.5483 233.0789 175.1097 72.6720 39.7204 23.0684 24.9311 22.8087 13.9737 17.9555 58.1560 22.6913 2.9027 2.5411 2.8827 6.1563 5.2764 7.0924 10.8860 2.5287 4.7662 4.7282 30.7590 15.1155 36.8229 6.8501 4.5000 7.6556
temp: 298.150 k
press: 1.00000 atm
elementType: 8 8 7 7 6 6 6 6 6 6 6 6 6 6 6 6 6 6 6 6 6 6 6 6 6 6 6 6 6 6 6 6 6 6 6 1 1 1 1 1 1 1 1 1 1 1 1 1 1 1 1
symmnumber: 1
zpe: 990754.1 jmol-1
zpe.correction: 0.377358 hartree
zpe.thermalcorrener: 0.401556 hartree
zpe.thermalcorrenthalpy: 0.402500 hartree
zpe.thermalcorrgfe: 0.323524 hartree
zpe.sumelectzpe: -1448.621427 hartree
zpe.sumelectthermal: -1448.597229 hartree
zpe.sumelectthermalent: -1448.596285 hartree
zpe.sumelectthermalfe: -1448.675262 hartree
dipole: -0.5448 -3.6331 -0.5775
dipole: 3.7188
quadrupole: -211.6946 -180.5356 -197.4742
quadrupole: 4.8342 -15.3163 -3.8181
quadrupole: -15.1265 16.0326 -0.9061 4.8342 -15.3163 -3.8181
hfenergy: -1448.9987857 hartree
pointgroup: C01 [X(C31H16N2O2)]
dipole: -0.3157279 -0.882065 -1.1238039 debye
polarizability: 629.3969921|27.8235966|299.1783646|-51.4547893|90.0837295|314.0364564 unknown
InChI: InChI=1S/C31H16N2O2/c34-30-20-10-3-1-8-18(20)27-25(16-15-17-7-5-12-22(30)26(17)27)33-24-14-6-13-23-28(24)29(32-33)19-9-2-4-11-21(19)31(23)35/h1-16H
charge 0 multiplicity 1
51 atoms
O  -5.418001 1.553425 1.725159
O  5.670655 0.262345 1.9045
N  0.347836 -0.575506 -0.430774
N  1.337049 -0.694502 -1.442707
C  -2.112507 -0.146748 -0.278804
C  -1.008823 -0.916034 -0.733813
C  2.315191 -0.233638 0.583047
C  -3.420948 -0.76412 -0.370525
C  0.925822 -0.315731 0.831872
C  2.523216 -0.465147 -0.806528
C  -2.029195 1.245618 0.233427
C  3.285965 0.006623 1.571052
C  -4.571216 -0.170828 0.257345
C  -3.600202 -2.013234 -1.07746
C  3.884543 -0.436337 -1.328986
C  -3.150876 1.816882 0.920615
C  -1.190736 -2.129379 -1.46938
C  4.938525 -0.181901 -0.376242
C  -4.447227 1.092345 1.036089
C  -2.461563 -2.65269 -1.667334
C  4.703172 0.047366 1.104733
C  0.445641 -0.157055 2.152428
C  2.814924 0.168309 2.892823
C  -5.833156 -0.78786 0.167974
C  -4.901838 -2.598999 -1.168314
C  -0.904812 2.09208 0.001156
C  1.415614 0.080999 3.159607
C  4.202766 -0.641293 -2.695405
C  -3.08894 3.137268 1.437948
C  -6.006607 -1.996128 -0.554575
C  6.279359 -0.14436 -0.83685
C  -0.864502 3.408831 0.494875
C  -1.947399 3.931695 1.245293
C  5.542857 -0.598657 -3.1263
C  6.584335 -0.34956 -2.195765
H  -0.298253 -2.633167 -1.849046
H  -2.598055 -3.581996 -2.231031
H  -0.617678 -0.206903 2.400902
H  3.526292 0.355518 3.703082
H  -6.672016 -0.303899 0.678777
H  -5.017308 -3.538762 -1.720807
H  -0.065277 1.733978 -0.596762
H  1.069359 0.207146 4.191111
H  3.391378 -0.830075 -3.40548
H  -3.971724 3.513927 1.964385
H  -6.997623 -2.455532 -0.624003
H  7.065289 0.049064 -0.099409
H  0.013182 4.031645 0.290826
H  -1.905011 4.951099 1.642506
H  5.781118 -0.757676 -4.183586
H  7.624906 -0.316744 -2.535246
