program: Gaussian 09
title: 000052274
version: EM64L-G09RevD.01
frameworkgroup: C1[X(C19H16N2O2)]
method: RPBEPBE
basis: SDD
operation: Freq
keyword: #p
keyword: freq=noraman
keyword: PBEPBE/SDD
title: #p freq=noraman PBEPBE/SDD
converged: YES YES NO NO
title: Mulliken charges:
elementType: O O N N C C C C C C C C C C C C C C C C C C C H H H H H H H H H H H H H H H H
charge: -0.298828 -0.265313 -0.494273 -0.472774 0.312838 0.305564 0.339667 0.292011 0.449322 0.446803 -0.674555 -0.670889 -0.559216 -0.410895 0.295460 -0.385693 -0.438754 -0.437210 -0.247341 -0.249182 0.158029 -0.215792 -0.676990 0.307523 0.306163 0.232904 0.232274 0.268881 0.229052 0.270689 0.238861 0.238580 0.225443 0.225553 0.227675 0.227379 0.211877 0.227567 0.227588
chargesum: 0.00000
title: Mulliken charges with hydrogens summed into heavy atoms:
elementType: O O N N C C C C C C C C C C C C C C C C C C C
charge: -0.298828 -0.265313 -0.186750 -0.166611 0.312838 0.305564 0.339667 0.292011 0.449322 0.446803 -0.441651 -0.438614 -0.290335 -0.181843 0.295460 -0.115003 -0.199894 -0.198630 -0.021898 -0.023629 0.158029 0.239261 -0.009958
polarizability: 5.54829612e+02 3.11596335e+01 2.37177508e+02 5.61705961e-02 -4.59205670e-02 9.54676532e+01
1716.lowfreq: -0.0004 0.0002 0.0011 4.1485 8.9166 11.4603 31.6932 34.7200 60.9546
frequency: 31.2009 34.0884 60.9442 63.1158 85.6070 99.4048 129.4131 139.0047 157.5915 207.9446 218.6105 249.8745 250.5246 277.5481 308.9651 322.3283 330.2217 341.4471 386.3682 425.9692 430.6471 446.1155 472.3425 498.8139 511.1169 519.8074 549.1192 559.6188 568.7765 570.1473 601.9461 625.8876 654.9725 701.6372 709.7340 737.5375 746.0260 751.3742 758.0747 764.7023 771.5316 798.4458 810.6652 829.0291 837.8206 838.0636 861.8067 870.5697 896.3614 897.9933 901.8004 948.8592 949.4365 957.8208 979.7983 1024.0166 1026.6431 1056.0174 1111.0359 1113.9100 1130.7225 1136.3225 1170.3034 1178.2829 1202.5313 1207.0631 1231.5592 1248.0247 1260.2536 1275.5191 1280.8533 1286.2310 1299.0966 1322.2555 1358.4898 1380.1336 1386.9526 1398.2883 1412.0337 1432.5611 1444.3978 1463.5008 1471.3360 1474.0569 1487.4180 1503.6012 1512.2967 1526.9062 1542.7226 1596.1940 1600.6515 1602.4120 1616.2708 1620.9079 1647.1242 2993.2737 3007.6238 3064.9047 3089.6829 3104.2277 3114.8710 3116.8354 3117.9358 3121.9660 3127.4442 3140.0279 3155.9962 3160.8039 3169.8670 3562.5646 3570.1033
redmass: 3.0819 5.4162 4.2589 3.1722 7.1959 3.1532 4.5037 5.1913 3.7135 3.5486 5.1605 1.3164 7.0163 3.8373 5.7619 4.1111 4.8557 3.9411 5.9864 2.5955 4.9971 2.8300 2.6054 4.9807 1.3101 7.0458 1.6051 2.9761 7.2087 3.7530 7.2711 6.9561 7.4721 4.6372 5.0330 6.4200 3.6660 1.2420 5.0483 6.8867 2.2446 1.0994 5.0619 1.5060 1.4021 3.8731 1.4704 3.6192 1.5535 2.0442 5.0223 4.4490 1.4070 1.3625 1.3305 2.2798 2.2360 4.1918 2.2085 1.9841 1.4409 1.4666 1.0801 1.8075 1.4472 1.6482 1.9176 1.1337 2.4288 2.1521 2.3956 2.4159 1.8795 1.7229 1.4614 2.0100 6.9392 1.2877 9.3796 3.1375 3.1756 1.0407 2.3009 1.0672 1.0725 3.1036 5.6579 3.2148 3.7200 8.5939 5.4809 5.8433 5.9294 7.6583 7.4770 1.0357 1.0581 1.1064 1.0985 1.1026 1.0901 1.0866 1.0916 1.0888 1.0898 1.0940 1.0916 1.1002 1.0949 1.0766 1.0766
irintensity: 0.4943 0.0015 0.1502 0.8942 0.4812 1.7760 4.0456 1.2731 0.3197 0.2166 4.3475 0.2622 0.9925 0.3526 6.5137 1.4327 9.9434 7.3732 9.7511 27.9742 1.7376 12.7194 11.7399 1.6607 12.0575 3.3483 112.9121 24.5693 0.8056 0.0199 3.9065 2.4558 3.4563 8.5573 22.6496 1.2788 10.9593 48.4159 0.2942 8.4359 0.0702 1.8892 3.6114 37.3581 0.0894 1.7954 104.0272 1.3253 27.8593 1.0317 8.9847 36.7481 11.5113 0.7253 0.0036 22.4762 8.8250 499.0965 5.9193 1.8437 77.8501 5.3201 9.4725 91.0830 129.6457 255.5766 0.1312 0.0059 30.0347 6.9497 55.4442 117.7605 49.4061 0.4040 5.8569 5.5253 404.9898 23.9592 5.2243 16.4755 0.8028 11.9535 141.3923 4.1630 16.6120 10.1326 946.7320 350.8718 1.2227 264.1007 142.1138 51.9329 3.5354 113.1074 42.2334 23.7340 32.4803 8.3226 40.5100 48.4038 8.5392 19.0803 7.1659 1.3090 14.0473 33.6984 5.9851 52.9286 2.7172 35.1967 19.7060
temp: 298.150 k
press: 1.00000 atm
elementType: 8 8 7 7 6 6 6 6 6 6 6 6 6 6 6 6 6 6 6 6 6 6 6 1 1 1 1 1 1 1 1 1 1 1 1 1 1 1 1
symmnumber: 1
zpe: 802129.6 jmol-1
zpe.correction: 0.305515 hartree
zpe.thermalcorrener: 0.324521 hartree
zpe.thermalcorrenthalpy: 0.325465 hartree
zpe.thermalcorrgfe: 0.257553 hartree
zpe.sumelectzpe: -992.030882 hartree
zpe.sumelectthermal: -992.011876 hartree
zpe.sumelectthermalent: -992.010932 hartree
zpe.sumelectthermalfe: -992.078844 hartree
dipole: 1.5215 1.2466 0.0055
dipole: 1.9669
quadrupole: -139.1443 -111.8224 -141.3153
quadrupole: -19.1885 -0.0313 -0.0266
quadrupole: -8.3837 18.9382 -10.5546 -19.1885 -0.0313 -0.0266
hfenergy: -992.3363971 hartree
pointgroup: C01 [X(C19H16N2O2)]
dipole: 0.6102493 -0.4757911 0.0081574 debye
polarizability: 556.0592351|-23.4156162|235.8519944|6.5761866|-0.8649443|95.5635442 unknown
InChI: InChI=1S/C19H16N2O2/c1-2-23-19(22)14-7-8-15-16(11-14)21-18-10-13-6-4-3-5-12(13)9-17(18)20-15/h3-11,20-21H,2H2,1H3
charge 0 multiplicity 1
39 atoms
O  -4.980558 -1.119075 -0.128021
O  -5.791802 1.069919 -0.141237
N  0.066907 -0.82049 -0.052532
N  0.677451 1.878745 -0.055763
C  1.426603 -0.454411 -0.035126
C  1.749123 0.958566 -0.037037
C  -0.995291 0.107482 -0.071556
C  -0.673629 1.503954 -0.072689
C  3.834902 -0.99566 0.000877
C  4.155289 0.416726 -0.001435
C  2.45544 -1.394837 -0.016295
C  3.079888 1.369009 -0.020617
C  -2.339448 -0.297723 -0.089076
C  -1.715749 2.4590 -0.090508
C  -3.384297 0.668395 -0.107269
C  -3.062531 2.047913 -0.107624
C  4.902406 -1.947374 0.019983
C  5.527643 0.817879 0.015317
C  6.239081 -1.527752 0.036136
C  6.554422 -0.135493 0.033785
C  -4.813652 0.277064 -0.126712
C  -6.393446 -1.598008 -0.148064
C  -6.342373 -3.122687 -0.137454
H  -0.163873 -1.813591 -0.052061
H  0.901954 2.873848 -0.056475
H  2.214094 -2.465254 -0.014559
H  3.319953 2.439927 -0.022126
H  -2.601154 -1.360394 -0.088967
H  -1.467464 3.52694 -0.090921
H  -3.876968 2.778163 -0.121314
H  4.661095 -3.017264 0.021785
H  5.76927 1.88779 0.013519
H  7.047424 -2.267064 0.050641
H  7.602176 0.184146 0.046524
H  -6.915256 -1.185289 0.734432
H  -6.885385 -1.197258 -1.053027
H  -7.36893 -3.532413 -0.154054
H  -5.802467 -3.505163 -1.020761
H  -5.835646 -3.494066 0.769882
