program: Gaussian 09
title: 000052270
version: EM64L-G09RevD.01
frameworkgroup: C1[X(C17H17NO3)]
method: RPBEPBE
basis: SDD
operation: Freq
keyword: #p
keyword: freq=noraman
keyword: PBEPBE/SDD
title: #p freq=noraman PBEPBE/SDD
converged: YES YES NO NO
title: Mulliken charges:
elementType: O O O N C C C C C C C C C C C C C C C C C H H H H H H H H H H H H H H H H H
charge: -0.282255 -0.291014 -0.262898 -0.077819 0.272377 0.225124 0.258550 0.224673 -0.335435 -0.337431 -0.371086 -0.340195 -0.350301 -0.365586 -0.356819 -0.246061 0.177705 -0.223137 -0.218959 -0.675673 -0.533896 0.269579 0.267738 0.254884 0.246107 0.280803 0.263989 0.241808 0.232637 0.228767 0.228256 0.227770 0.211021 0.228613 0.229136 0.248154 0.224896 0.225979
chargesum: 0.00000
title: Mulliken charges with hydrogens summed into heavy atoms:
elementType: O O O N C C C C C C C C C C C C C C C C C
charge: -0.282255 -0.291014 -0.262898 -0.077819 0.272377 0.225124 0.258550 0.224673 -0.065856 -0.069693 -0.116201 -0.094089 -0.069497 -0.101596 -0.115011 -0.013424 0.177705 0.005629 0.237066 -0.006903 0.165133
polarizability: 4.38617658e+02 2.61946973e+00 2.03106529e+02 -1.43499581e+01 -3.12739075e+00 1.09213049e+02
1716.lowfreq: -4.1961 -1.6091 -0.0004 0.0005 0.0006 4.9655 16.9912 30.5055 36.8582
frequency: 16.5677 30.4724 36.8466 43.0073 73.6687 84.5288 89.7314 101.8801 124.0958 150.5302 167.7075 190.5530 199.9278 242.0179 244.2945 252.9954 280.1865 294.8614 333.4619 345.9510 376.5406 411.0495 419.2812 469.1386 475.1975 508.1165 531.8548 543.5598 553.3528 585.3380 630.5777 656.2071 681.2460 740.4083 751.6219 761.4042 763.9826 788.4514 797.3705 825.5542 835.2224 848.1023 853.7578 862.1170 875.7177 957.2208 977.9262 986.7175 989.8216 993.9429 1000.3811 1003.4449 1022.9071 1040.3378 1060.3554 1097.3902 1111.6341 1112.3959 1114.4962 1136.3753 1150.6920 1165.7488 1172.5928 1190.9236 1212.6607 1241.0966 1248.2354 1249.8866 1288.5718 1298.2800 1345.7751 1358.8089 1367.6398 1398.8490 1399.3774 1423.0535 1430.9115 1448.9564 1463.9937 1466.9743 1469.2763 1473.6443 1480.1168 1486.8034 1493.3174 1556.0349 1574.5424 1587.3602 1609.6052 1611.6096 1622.4101 2966.3010 2994.5651 3007.9892 3019.2746 3057.3341 3065.4781 3091.0231 3105.9434 3129.0905 3133.9231 3138.3522 3149.6898 3149.9359 3163.9473 3169.2282 3173.5588 3173.8276
redmass: 3.7018 4.8675 3.9111 3.4951 3.5270 4.9327 4.3845 3.3095 3.3039 4.2106 5.9726 2.6426 4.0433 1.9196 2.1685 1.3206 3.9563 2.9425 4.2444 5.2163 5.3135 3.3236 4.6617 3.6461 4.9898 4.0838 3.9078 3.7178 4.6409 6.5864 7.1266 6.5718 4.1041 3.3837 5.5902 3.3975 1.4568 6.0449 1.1040 5.2016 1.7220 3.4890 1.8353 1.4473 2.3974 1.3511 1.3557 8.7511 1.4098 1.3642 1.9293 2.1105 2.2788 2.0480 5.1191 2.3241 2.1061 1.2586 1.3946 1.4704 1.3951 1.5276 1.1108 1.6571 2.3108 2.4893 1.1328 3.0297 1.5873 1.3423 2.1743 1.4238 4.8355 1.4716 2.6681 4.2450 1.4140 1.8261 1.0405 1.3893 1.0558 1.0591 1.5672 1.1048 2.5124 7.6392 7.1693 6.3280 6.8694 9.7235 6.7226 1.0326 1.0357 1.0581 1.0878 1.1043 1.1065 1.0985 1.1025 1.0997 1.0862 1.0889 1.0881 1.0898 1.0941 1.0961 1.0994 1.0964
irintensity: 0.3734 0.0982 0.7534 0.2899 0.7607 1.6345 0.0448 4.8566 1.7163 2.7344 0.9812 7.9150 8.7103 12.4517 0.4039 0.6661 9.2612 4.4044 5.7050 0.4005 10.6452 1.6326 10.0271 19.4164 1.4289 6.4374 3.8043 5.3241 1.3579 12.5308 1.2208 14.0555 28.0838 8.6195 12.1136 5.9207 92.5649 7.4611 1.9811 3.7066 32.7124 8.7519 17.0923 0.6023 44.0808 1.9278 0.8604 43.3945 11.2917 0.7317 3.5429 71.5061 22.0660 10.9154 451.4562 35.0535 3.9558 0.1507 9.9613 5.4587 8.7217 191.0824 23.5030 6.8460 94.8717 291.5539 0.1746 353.1732 29.4348 8.9022 7.5189 5.9027 3.7416 23.7188 78.1918 8.1315 31.8926 15.2227 11.7827 95.6474 15.4204 5.8842 16.6302 13.8492 19.5917 30.3509 311.8135 212.2638 104.1314 157.0786 40.4056 79.6219 24.4728 27.8138 21.4072 42.2168 9.0392 37.0591 46.4435 17.2950 0.9498 7.2041 0.9869 8.3755 15.4620 9.2653 29.1838 2.0817
temp: 298.150 k
press: 1.00000 atm
elementType: 8 8 8 7 6 6 6 6 6 6 6 6 6 6 6 6 6 6 6 6 6 1 1 1 1 1 1 1 1 1 1 1 1 1 1 1 1 1
symmnumber: 1
zpe: 786132.0 jmol-1
zpe.correction: 0.299422 hartree
zpe.thermalcorrener: 0.319422 hartree
zpe.thermalcorrenthalpy: 0.320366 hartree
zpe.thermalcorrgfe: 0.248141 hartree
zpe.sumelectzpe: -936.911026 hartree
zpe.sumelectthermal: -936.891026 hartree
zpe.sumelectthermalent: -936.890081 hartree
zpe.sumelectthermalfe: -936.962306 hartree
dipole: 4.3584 4.4027 -0.4658
dipole: 6.2126
quadrupole: -91.7761 -111.4571 -126.1736
quadrupole: -2.7986 6.8080 2.5639
quadrupole: 18.0262 -1.6549 -16.3713 -2.7986 6.8080 2.5639
hfenergy: -937.2104474 hartree
pointgroup: C01 [X(C17H17N1O3)]
dipole: 1.6701564 1.4436516 -1.0491446 debye
polarizability: 438.7729383|11.2816821|172.1256251|-0.7772155|-44.6923709|140.0386724 unknown
InChI: InChI=1S/C17H17NO3/c1-3-21-17(19)13-8-10-15(11-9-13)18-12-14-6-4-5-7-16(14)20-2/h4-12H,3H2,1-2H3
charge 0 multiplicity 1
38 atoms
O  3.47543 2.11451 -0.471306
O  -5.244797 0.083079 -0.673101
O  -5.490116 -1.083071 1.331895
N  0.988194 -0.953525 0.631481
C  3.254925 -0.163271 0.25906
C  -3.255718 -0.652703 0.447746
C  -0.415958 -0.811497 0.547015
C  4.115167 0.918032 -0.118381
C  -2.609488 -1.3194 1.524741
C  -2.471608 -0.082821 -0.590054
C  -1.210001 -1.410646 1.567289
C  -1.068928 -0.159172 -0.543149
C  3.845318 -1.402947 0.624615
C  1.79712 0.015823 0.266311
C  5.521089 0.749466 -0.123792
C  5.241915 -1.57582 0.620524
C  -4.7409 -0.594583 0.446476
C  6.076377 -0.495372 0.245537
C  -6.7311 0.189914 -0.747788
C  -7.053928 0.955555 -2.027168
C  4.309849 3.259106 -0.849015
H  -3.22919 -1.76374 2.310423
H  -2.975479 0.410752 -1.425819
H  -0.699721 -1.932278 2.382671
H  -0.468752 0.255071 -1.361175
H  3.167339 -2.213486 0.910825
H  1.427125 1.015824 -0.025749
H  6.183411 1.571074 -0.410625
H  5.680633 -2.537155 0.906019
H  7.165195 -0.618674 0.239496
H  -7.155234 -0.830701 -0.745704
H  -7.089745 0.70964 0.159382
H  -8.148872 1.066448 -2.130634
H  -6.60309 1.962625 -2.007973
H  -6.674002 0.419864 -2.914019
H  3.59944 4.069336 -1.068084
H  4.912232 3.036096 -1.75043
H  4.97607 3.560446 -0.018138
