program: Gaussian 09
title: 000052216
version: EM64L-G09RevD.01
frameworkgroup: C1[X(C13H7Cl4NO)]
method: RPBEPBE
basis: SDD
operation: Freq
keyword: #p
keyword: freq=noraman
keyword: PBEPBE/SDD
title: #p freq=noraman PBEPBE/SDD
converged: YES YES NO NO
title: Mulliken charges:
elementType: Cl Cl Cl Cl O N C C C C C C C C C C C C C H H H H H H H
charge: -0.059394 -0.041001 0.005549 0.011870 -0.255278 -0.474803 0.663780 0.290894 0.150969 -0.411208 -0.261048 -0.314740 -0.346416 -0.108417 -0.196480 -0.088030 -0.213628 -0.252282 -0.086818 0.321690 0.340475 0.303804 0.228057 0.261913 0.264750 0.265792
chargesum: 0.00000
title: Mulliken charges with hydrogens summed into heavy atoms:
elementType: Cl Cl Cl Cl O N C C C C C C C C C C C C C
charge: -0.059394 -0.041001 0.005549 0.011870 -0.255278 -0.153113 0.663780 0.290894 0.150969 -0.411208 0.079427 -0.010936 -0.118359 -0.108417 0.065433 -0.088030 0.051122 0.013510 -0.086818
polarizability: 3.34168092e+02 -8.79929491e+00 2.10921011e+02 -2.53255600e+00 -4.34866924e+00 7.19114120e+01
1716.lowfreq: -6.2219 -5.4284 -1.0955 -0.0029 -0.0021 -0.0018 15.1868 27.3400 45.2713
frequency: 15.1715 27.3373 45.2690 81.9833 88.7067 99.0892 131.5894 146.2206 163.2800 186.8803 225.1958 239.6490 268.9199 285.1218 308.1520 311.7809 324.5819 416.5392 426.0300 439.8096 443.3972 448.6431 506.2111 512.5195 546.2401 577.6318 594.2622 659.7899 674.1953 688.8078 692.3382 719.1000 741.6475 755.2202 797.8747 817.9549 881.4474 891.5070 921.7510 928.1274 936.8825 948.7662 1003.0567 1006.9449 1078.1767 1096.7189 1119.9749 1136.7085 1161.4175 1223.7972 1239.1496 1257.5456 1279.7229 1362.7905 1369.4942 1385.8285 1407.9177 1438.7388 1459.1098 1508.7555 1556.5747 1573.0808 1591.5891 1600.3423 1610.4490 3132.6519 3167.7163 3169.2047 3174.2883 3187.2416 3191.6733 3493.0345
redmass: 11.8829 10.7205 13.3029 8.2546 8.0982 9.8947 13.7886 13.8673 6.0546 27.3773 5.8963 11.9552 9.9176 8.0528 18.6408 7.6247 9.7283 6.2029 10.0296 3.5401 3.4753 5.0883 9.1737 7.0515 6.4109 4.3202 6.9284 7.0861 1.5540 4.5005 7.1549 3.1675 3.2686 7.9111 1.3258 1.4921 7.1993 6.1232 1.3712 1.4933 1.3493 1.3756 5.6993 6.9083 1.8491 2.8425 2.5569 1.4267 1.5251 1.8572 1.6792 1.6425 1.9102 4.3682 7.0393 4.9757 4.0872 2.6039 2.8044 2.5856 8.0818 4.8652 6.3704 7.5447 5.4157 1.0903 1.0893 1.0924 1.0953 1.0976 1.0937 1.0758
irintensity: 0.1066 0.1934 0.0329 3.4554 2.1816 1.3364 0.5620 2.2836 1.1247 0.2112 2.2183 1.9307 2.4911 2.7741 0.5782 2.2120 3.0864 13.0431 1.5546 2.7362 24.9921 9.4880 18.8499 32.3090 9.9139 0.8559 4.5368 18.1497 33.3962 13.9366 13.2554 3.9682 56.7201 20.6379 44.8939 27.9786 5.6234 70.8800 21.7839 17.2895 9.6534 3.5968 62.2632 52.4631 23.0773 18.1844 23.7153 2.4439 11.9209 204.8130 6.2913 8.1836 105.9517 1.8602 145.2182 18.1290 114.0689 56.7988 108.7239 587.9493 56.9742 42.5841 51.8034 73.7412 122.2016 9.1051 0.3742 4.5600 2.1001 0.0142 22.9826 38.7952
temp: 298.150 k
press: 1.00000 atm
elementType: 17 17 17 17 8 7 6 6 6 6 6 6 6 6 6 6 6 6 6 1 1 1 1 1 1 1
symmnumber: 1
zpe: 436034.7 jmol-1
zpe.correction: 0.166077 hartree
zpe.thermalcorrener: 0.183362 hartree
zpe.thermalcorrenthalpy: 0.184307 hartree
zpe.thermalcorrgfe: 0.117573 hartree
zpe.sumelectzpe: -2468.492113 hartree
zpe.sumelectthermal: -2468.474828 hartree
zpe.sumelectthermalent: -2468.473884 hartree
zpe.sumelectthermalfe: -2468.540618 hartree
dipole: 1.2428 4.3040 -0.0643
dipole: 4.4803
quadrupole: -138.8162 -137.7887 -139.8229
quadrupole: 4.6753 1.9349 -2.2167
quadrupole: -0.0069 1.0206 -1.0136 4.6753 1.9349 -2.2167
hfenergy: -2468.6581902 hartree
pointgroup: C01 [X(C13H7Cl4N1O1)]
dipole: -0.5228453 1.6824366 0.0561834 debye
dipolederiv: -0.2786185 -0.2502856 0.0241496 -0.1645409 -0.623362 0.0548224 0.0105222 0.0415204 -0.0519322 -0.344058 -0.2754228 0.0229811 -0.4170465 -0.6287259 0.0487833 0.0340025 0.046912 -0.062548 -0.4359742 0.301876 0.0947701 0.4018073 -0.3735813 -0.1081613 0.1274055 -0.1079326 -0.0578156 -0.8472774 -0.2052808 -0.0243095 -0.259158 -0.1140677 -0.0165262 -0.0322198 -0.014642 -0.0229092 -0.8369333 -0.1529641 -0.0127023 0.2994321 -0.8660495 0.0506447 -0.0657708 0.0103298 -0.3403739 -2.10733 0.3064447 -0.0586543 0.7173477 -0.5497546 0.020893 -0.1384474 0.0074499 -0.2912191 1.3848141 -0.2120075 0.0274203 0.186136 -0.0833855 0.0244109 0.0275563 0.0147868 0.13686 -0.5227602 -0.0963257 -0.0051879 -0.2311952 -0.0216217 0.0267483 0.0146842 0.0170555 -0.0168677 2.3049544 -0.0539371 0.078664 -0.857421 1.1418382 -0.1107856 0.1803974 -0.0367946 0.2379025 -0.0618555 0.3837548 -0.038342 0.3668848 0.8157917 -0.089402 -0.0278374 -0.0741004 -0.1221527 -0.4846821 -0.0351241 -0.0016515 -0.2947911 -0.2565906 0.0101721 0.0248652 0.0134656 -0.112259 -0.1255052 0.2271596 0.0592422 -0.0633172 -0.1103618 -0.013133 0.0282007 -0.0393355 -0.0595993 0.0050482 -0.0002035 -0.0311261 0.1556794 -0.0129115 0.042814 -0.0709429 0.0385296 -0.1231198 0.5800341 0.4004537 -0.0321317 0.7015282 1.0180243 -0.0899642 -0.0567406 -0.0879413 -0.0556161 0.0630181 0.0193931 -0.0015169 -0.1203937 -0.0736868 0.0022514 0.0061236 0.0005121 -0.0693433 0.3988217 -0.6926033 -0.2013582 -0.751055 0.4963009 0.1676986 -0.2292927 0.1765271 0.0117655 -0.38052 -0.0786787 -0.0054414 0.0821256 0.0270683 0.0297664 0.040176 0.033642 -0.0712679 -0.218008 -0.078921 0.0060647 -0.12094 -0.3189687 0.0159621 0.0098825 0.0151623 -0.1329833 1.0992222 0.4756265 0.0734336 0.405269 0.0524547 0.0099793 0.0538451 0.003101 -0.0466243 0.3047768 -0.0501355 0.0036994 -0.1493878 0.2056362 0.0059886 0.0344052 0.0050196 0.2819031 0.2428127 0.0199745 0.0007419 0.00108 0.0933954 0.0073846 -0.0034821 0.0044603 0.185897 0.175167 -0.0387726 -0.0072496 0.0055714 0.0707207 -0.0281905 -0.022497 -0.0151735 0.1548449 -0.0109641 0.0857217 0.0354498 0.1090084 0.0321274 -0.0385019 0.0600261 -0.0287324 0.1370966 0.0650937 0.0361419 -0.0038173 0.0560866 -0.0057249 0.0147685 -0.0050686 0.0145448 0.1647148 0.0563299 -0.0249406 -0.00328 -0.0410569 -0.0030389 -0.045961 -0.0006981 -0.0454629 0.1506256 -0.0256064 -0.0109437 0.000152 -0.0176534 0.0884735 0.0075375 0.0009049 0.0070964 0.1750215 unknown
polarizability: 333.7309698|11.360356|211.1435499|-3.7338807|6.5812364|72.1259955 unknown
InChI: InChI=1S/C13H7Cl4NO/c14-8-2-4-10(16)12(6-8)18-13(19)7-1-3-9(15)11(17)5-7/h1-6,18H
charge 0 multiplicity 1
26 atoms
Cl -2.126362 3.05753 -0.285326
Cl -5.066598 -2.633549 0.183032
Cl 5.227453 -2.019433 -0.568179
Cl 6.113391 1.054861 0.191496
O  -0.077928 -1.861234 0.083105
N  -0.752058 0.384085 -0.050811
C  -2.158079 0.251803 -0.049677
C  1.637717 -0.148291 0.091254
C  0.208604 -0.62635 0.0469
C  -2.957702 1.425678 -0.152847
C  -2.827249 -0.999843 0.0520
C  2.634026 -1.112027 -0.200496
C  2.029612 1.172972 0.433356
C  -4.231468 -1.022538 0.050393
C  -4.358913 1.38521 -0.155421
C  3.993462 -0.758376 -0.176708
C  3.393651 1.524535 0.46164
C  -5.019679 0.139895 -0.051741
C  4.377433 0.562622 0.149344
H  -0.418541 1.345501 -0.168608
H  -2.232884 -1.911966 0.124917
H  2.323492 -2.134367 -0.435809
H  1.296987 1.9355 0.720594
H  -4.934282 2.311224 -0.236338
H  3.703837 2.537493 0.732725
H  -6.110922 0.085666 -0.051993
