program: Gaussian 09
title: 000052202
version: EM64L-G09RevD.01
frameworkgroup: C1[X(C11H18N2O3S)]
method: RPBEPBE
basis: SDD
operation: Freq
keyword: #p
keyword: freq=noraman
keyword: PBEPBE/SDD
title: #p freq=noraman PBEPBE/SDD
converged: YES YES NO NO
title: Mulliken charges:
elementType: S O O O N N C C C C C C C C C C C H H H H H H H H H H H H H H H H H H
charge: 0.214413 -0.195102 -0.216600 -0.221139 -0.381035 -0.374345 0.113625 -0.438370 -0.045355 -0.779120 0.176285 0.151801 -0.697606 -0.698969 0.144161 -0.588357 -0.653901 0.252274 0.217265 0.196482 0.301768 0.273906 0.213911 0.233222 0.208274 0.239995 0.212546 0.206875 0.366911 0.366975 0.251557 0.260415 0.231866 0.232237 0.223135
chargesum: 0.00000
title: Mulliken charges with hydrogens summed into heavy atoms:
elementType: S O O O N N C C C C C C C C C C C
charge: 0.214413 -0.195102 -0.216600 -0.221139 -0.014124 -0.007370 0.113625 0.031170 0.151127 -0.203446 0.176285 0.151801 -0.042201 -0.039552 0.144161 -0.076386 0.033337
polarizability: 2.06813195e+02 -1.75610398e+01 1.34479510e+02 2.13664268e+00 6.21116525e+00 1.41901232e+02
1716.lowfreq: -16.0232 -7.0539 0.0016 0.0020 0.0022 3.6891 29.6992 33.3144 43.9417
frequency: 29.4997 32.7475 43.7807 48.1436 58.4770 107.9095 123.3196 140.4986 151.2836 162.7194 175.7187 198.8480 219.5793 236.3386 248.2203 260.5999 277.6673 304.1215 351.5514 355.5335 369.7327 382.3607 386.4556 459.6047 481.0330 539.0067 586.7587 616.5066 618.0844 638.7320 676.0444 691.7221 729.6009 743.8750 763.6128 784.6539 790.6831 792.4678 824.3204 873.8073 914.5691 940.3136 960.1095 979.1396 993.5565 995.0264 1009.0999 1026.9751 1041.5371 1070.5771 1115.6728 1136.2798 1180.7249 1202.4755 1230.5871 1237.4567 1259.7405 1277.4348 1288.9057 1298.0826 1315.4043 1333.9753 1359.1246 1366.2807 1373.9745 1375.5089 1382.2214 1397.7772 1399.8014 1428.2949 1450.7578 1461.4362 1461.6218 1469.7525 1478.7210 1480.5377 1483.9839 1492.2940 1611.5415 1648.0109 1676.4520 2952.9594 2973.1645 2976.9212 2987.4016 2988.8629 3016.1281 3018.3669 3053.5756 3058.3013 3065.4714 3078.4338 3081.5178 3082.0212 3087.2853 3094.8248 3105.1378 3516.5485 3518.1979
redmass: 6.4659 2.8583 3.9565 2.0435 3.6090 5.4602 3.8429 5.1141 8.2315 11.9449 4.7991 4.0225 3.2074 1.1181 1.4624 1.7118 1.1435 2.7056 4.4292 10.1347 2.7771 4.0120 2.1962 5.4056 9.1742 3.0253 7.5227 4.0899 5.5295 3.5402 2.5342 3.6485 4.8589 3.2685 2.1775 2.2203 1.6758 1.2530 2.1782 1.6932 1.2234 4.7470 1.4531 2.4748 2.4689 2.0398 2.3909 1.2103 2.5956 2.2655 1.7594 2.3685 2.3878 2.0075 1.4069 1.2509 1.2314 1.2583 2.8573 1.3887 1.7452 1.6029 1.3301 6.8524 1.9038 1.5405 1.2130 1.2027 1.2096 1.0912 1.0866 1.0873 1.0495 1.0387 1.0536 1.0525 1.0479 1.0536 6.7903 8.5961 5.4201 1.0818 1.0360 1.0365 1.0363 1.0595 1.0571 1.0574 1.1029 1.0988 1.0979 1.1032 1.1002 1.0988 1.0997 1.1071 1.1056 1.0757 1.0781
irintensity: 0.5402 0.0252 0.5794 0.8268 0.0050 0.6803 0.2808 0.4060 0.3989 15.8612 0.4307 0.8667 1.1403 0.1242 1.4311 1.2740 0.8727 2.9485 4.8179 22.5542 3.5322 0.8012 0.8889 27.1286 15.2394 7.9352 1.0781 4.2450 3.3291 2.7991 10.8848 16.0541 14.7693 37.4466 9.9181 10.1529 122.3103 88.4086 5.3649 4.7499 1.7568 29.9544 0.0510 8.5429 13.3785 12.4291 0.6840 1.3253 16.6213 1.9001 2.6692 0.8186 38.8215 3.7257 27.1081 2.0645 32.0850 7.9409 274.7478 10.0185 96.6964 19.0449 15.4208 209.0656 4.3105 4.9210 9.5773 19.5816 21.6087 14.7985 12.4009 8.3417 7.9956 15.8371 7.9146 28.3510 8.5163 12.2226 279.2307 38.9328 655.7566 13.1788 20.3490 31.2980 37.7863 8.7461 13.8454 15.0153 7.3106 2.3164 111.8340 0.3384 17.2194 28.9818 27.0833 2.2260 44.6263 85.6969 47.6747
temp: 298.150 k
press: 1.00000 atm
elementType: 16 8 8 8 7 7 6 6 6 6 6 6 6 6 6 6 6 1 1 1 1 1 1 1 1 1 1 1 1 1 1 1 1 1 1
symmnumber: 1
zpe: 744893.5 jmol-1
zpe.correction: 0.283715 hartree
zpe.thermalcorrener: 0.302741 hartree
zpe.thermalcorrenthalpy: 0.303685 hartree
zpe.thermalcorrgfe: 0.235230 hartree
zpe.sumelectzpe: -1161.923747 hartree
zpe.sumelectthermal: -1161.904721 hartree
zpe.sumelectthermalent: -1161.903777 hartree
zpe.sumelectthermalfe: -1161.972233 hartree
dipole: -1.5608 1.4902 1.2613
dipole: 2.4995
quadrupole: -111.8556 -108.9667 -118.8310
quadrupole: 1.4238 -5.0061 -3.3607
quadrupole: 1.3622 4.2511 -5.6132 1.4238 -5.0061 -3.3607
hfenergy: -1162.2074624 hartree
pointgroup: C01 [X(C11H18N2O3S1)]
dipole: -0.476619 -0.6083069 -0.6081686 debye
polarizability: 198.3765208|28.8380201|141.1293257|3.2356335|6.8652881|143.6880904 unknown
InChI: InChI=1S/C11H18N2O3S/c1-4-17-6-11(5-7(2)3)8(14)12-10(16)13-9(11)15/h7,12-13H,4-6H2,1-3H3
charge 0 multiplicity 1
35 atoms
S  -2.951849 0.660318 0.516661
O  -0.274092 0.407857 2.388495
O  0.707382 0.430815 -2.388512
O  3.395584 2.675698 0.663692
N  1.511881 1.549693 1.474115
N  2.026434 1.508018 -0.828823
C  -0.058134 0.313328 -0.058352
C  -0.361227 -1.22039 -0.132036
C  0.773694 -2.257699 0.119694
C  -1.38186 1.132186 -0.405388
C  0.369034 0.724854 1.357511
C  0.912441 0.724972 -1.181366
C  1.910872 -2.2308 -0.931875
C  1.359317 -2.234936 1.553397
C  2.38315 1.962821 0.454347
C  -3.83557 -0.359402 -0.829606
C  -5.232411 -0.737047 -0.31698
H  -1.170547 -1.391707 0.603398
H  -0.771889 -1.400507 -1.144622
H  0.255843 -3.234465 0.003758
H  -1.576628 1.00017 -1.4832
H  -1.21579 2.205088 -0.20583
H  2.561851 -3.116113 -0.808431
H  1.517857 -2.229241 -1.96413
H  2.554553 -1.338477 -0.815066
H  0.566058 -2.218501 2.321097
H  1.987338 -3.130254 1.717597
H  2.006872 -1.35332 1.71983
H  1.756947 1.860026 2.420476
H  2.646552 1.801658 -1.591035
H  -3.895735 0.262786 -1.739348
H  -3.227296 -1.254659 -1.03912
H  -5.171057 -1.343502 0.604092
H  -5.834994 0.162073 -0.097788
H  -5.767681 -1.330241 -1.081152
