program: Gaussian 09
title: 000052156
version: EM64L-G09RevD.01
frameworkgroup: C1[X(C13H17NO)]
method: RPBEPBE
basis: SDD
operation: Freq
keyword: #p
keyword: freq=noraman
keyword: PBEPBE/SDD
title: #p freq=noraman PBEPBE/SDD
converged: YES YES NO NO
title: Mulliken charges:
elementType: O N C C C C C C C C C C C C C H H H H H H H H H H H H H H H H H
charge: -0.222958 -0.372045 0.048365 -0.463364 -0.442205 0.109758 -0.019007 0.469037 -0.710535 -0.706098 -0.395787 -0.436851 -0.241642 -0.243606 -0.241714 0.228166 0.203914 0.236875 0.239890 0.191774 0.307750 0.215961 0.202502 0.213704 0.246696 0.205218 0.212012 0.265213 0.220468 0.226112 0.224480 0.227918
chargesum: 0.00000
title: Mulliken charges with hydrogens summed into heavy atoms:
elementType: O N C C C C C C C C C C C C C
charge: -0.222958 -0.064295 0.048365 -0.031284 0.034561 0.109758 0.172767 0.469037 -0.078368 -0.042172 -0.130574 -0.216383 -0.015530 -0.019126 -0.013796
polarizability: 1.64583072e+02 4.44958921e+00 1.24310876e+02 -6.31616842e+00 1.40416283e+01 1.34471422e+02
1716.lowfreq: -12.1704 -8.9425 -0.0009 -0.0007 -0.0005 11.5652 52.2634 64.4722 77.6291
frequency: 52.0955 64.3522 77.5945 107.6932 124.3329 136.7998 176.4142 198.3986 206.4083 249.5699 274.0596 280.8408 338.8503 358.0395 362.8986 404.8392 415.0293 498.8544 508.9613 551.5476 612.0183 615.3495 655.7104 686.3914 707.3842 743.9500 769.6504 793.1668 844.8880 854.8453 894.7709 913.3058 918.3977 932.9124 957.8679 966.6971 976.3929 985.2883 989.5804 995.7825 1011.8080 1037.1722 1083.8613 1090.7360 1118.0758 1132.3942 1138.8928 1161.1281 1173.6245 1197.4098 1204.4627 1230.3206 1249.9601 1285.6915 1317.6485 1321.3622 1334.6678 1347.1098 1358.4814 1375.2002 1377.6346 1392.8659 1433.7207 1451.2162 1465.3695 1475.1184 1482.1498 1485.0931 1487.4906 1493.7637 1586.6104 1611.7094 1730.8905 2944.1566 2964.9033 2969.8001 2978.2506 3019.6846 3022.7202 3061.3767 3064.7262 3068.1703 3090.1433 3094.1657 3120.0296 3127.5713 3139.1468 3148.0136 3163.1141 3543.5298
redmass: 3.2299 3.7782 3.5853 4.5453 4.0744 3.7621 3.0568 3.0725 1.2269 2.7271 1.4649 2.2243 3.0243 2.4653 2.2337 2.8149 2.2119 1.9531 2.4164 2.1622 3.6032 5.8926 5.1235 6.7346 1.6985 3.8576 2.3530 2.8886 2.1354 1.2555 1.7525 1.3308 1.5303 2.5295 1.5979 2.0245 1.4373 2.2789 4.1852 1.3997 2.7099 1.8997 1.7172 1.8409 1.8545 2.5931 1.2859 2.6618 1.0559 1.1357 2.2992 1.7956 1.5250 1.6551 1.5213 1.3924 1.6078 1.7083 1.3157 6.0061 1.2355 1.2167 2.2620 1.0848 1.0468 1.0612 1.0678 1.9407 1.1186 1.0824 5.9735 5.9545 10.1815 1.0768 1.0642 1.0362 1.0399 1.0978 1.0583 1.0997 1.0989 1.0991 1.1092 1.0979 1.0844 1.0871 1.0920 1.0962 1.1015 1.0817
irintensity: 0.1934 0.6526 0.7185 2.7726 0.6379 2.3884 2.1287 0.9419 0.5957 1.2471 0.1513 2.5389 5.4255 1.1635 1.4370 0.2571 17.6957 38.7535 25.6215 77.1743 32.6745 3.7195 6.0027 2.2468 57.9657 8.6010 27.1521 1.6408 4.5184 0.5779 2.9885 2.1499 2.3160 2.9188 0.7639 0.6480 0.0089 12.3979 0.2245 0.3350 4.6305 8.6977 10.9526 17.2481 17.0695 43.0177 20.8588 32.3248 0.1327 2.0310 9.5276 3.0260 28.1994 3.2294 4.4000 4.1114 1.2959 2.1958 6.7413 0.7980 18.7911 13.6707 9.4744 2.9515 8.7953 0.3572 11.0159 14.3303 18.2175 20.3530 2.5636 10.7311 343.6249 12.4741 58.2438 36.2538 24.1506 15.9273 43.4568 19.0818 44.0402 74.0258 31.8024 34.7067 3.8087 1.7694 23.6712 26.6978 22.2904 12.4080
temp: 298.150 k
press: 1.00000 atm
elementType: 8 7 6 6 6 6 6 6 6 6 6 6 6 6 6 1 1 1 1 1 1 1 1 1 1 1 1 1 1 1 1 1
symmnumber: 1
zpe: 707980.4 jmol-1
zpe.correction: 0.269655 hartree
zpe.thermalcorrener: 0.284308 hartree
zpe.thermalcorrenthalpy: 0.285252 hartree
zpe.thermalcorrgfe: 0.228405 hartree
zpe.sumelectzpe: -634.424406 hartree
zpe.sumelectthermal: -634.409754 hartree
zpe.sumelectthermalent: -634.408810 hartree
zpe.sumelectthermalfe: -634.465656 hartree
dipole: -0.7650 2.3359 2.8861
dipole: 3.7910
quadrupole: -81.1417 -98.0403 -87.3547
quadrupole: -0.6038 -6.0060 -6.3882
quadrupole: 7.7039 -9.1947 1.4908 -0.6038 -6.0060 -6.3882
hfenergy: -634.6940615 hartree
pointgroup: C01 [X(C13H17N1O1)]
dipole: 0.2689464 -0.9766153 1.0947235 debye
polarizability: 165.4528477|-0.0258002|124.7458056|3.5930167|-14.8611746|133.1667162 unknown
InChI: InChI=1S/C13H17NO/c1-10(2)8-13(9-14-12(13)15)11-6-4-3-5-7-11/h3-7,10,14H,8-9H2,1-2H3
charge 0 multiplicity 1
32 atoms
O  1.509326 2.462965 -1.271576
N  2.322771 1.675885 0.871902
C  0.949597 0.2601 0.05136
C  1.457546 -0.794098 -0.981847
C  1.810298 0.371649 1.379118
C  1.588036 1.67001 -0.310223
C  1.098556 -2.302402 -0.810099
C  -0.566183 0.328792 0.205127
C  1.457543 -2.870587 0.584274
C  -0.362406 -2.651462 -1.19135
C  -1.337793 0.897198 -0.843916
C  -1.240034 -0.162112 1.352276
C  -2.74476 0.958847 -0.751244
C  -2.649293 -0.101811 1.44568
C  -3.408867 0.455597 0.392191
H  1.100428 -0.466249 -1.978738
H  2.564212 -0.703728 -1.009521
H  1.228511 0.463035 2.311231
H  2.591891 -0.397957 1.488497
H  1.748381 -2.822294 -1.547631
H  2.987661 2.348433 1.259582
H  0.82478 -2.424781 1.374105
H  2.517696 -2.684366 0.841498
H  1.293131 -3.963987 0.608374
H  -1.087244 -2.256778 -0.460212
H  -0.490923 -3.749816 -1.238406
H  -0.62512 -2.235913 -2.18193
H  -0.827333 1.311161 -1.720804
H  -0.671285 -0.607024 2.177167
H  -3.322823 1.406316 -1.567723
H  -3.151521 -0.490674 2.338927
H  -4.50128 0.50275 0.463513
