program: Gaussian 09
title: 000052182
version: EM64L-G09RevD.01
frameworkgroup: C1[X(C10H16N2O3S)]
method: RPBEPBE
basis: SDD
operation: Freq
keyword: #p
keyword: freq=noraman
keyword: PBEPBE/SDD
title: #p freq=noraman PBEPBE/SDD
converged: YES YES NO NO
title: Mulliken charges:
elementType: S O O O N N C C C C C C C C C C H H H H H H H H H H H H H H H H
charge: 0.161031 -0.207391 -0.229433 -0.220678 -0.372297 -0.372254 0.132949 -0.075908 -0.817823 0.187388 0.196800 -0.707481 -0.721811 0.150643 -0.601898 -0.652778 0.224833 0.278522 0.305918 0.217620 0.219418 0.247302 0.220798 0.218704 0.263312 0.366456 0.363781 0.247740 0.298295 0.228877 0.227968 0.221396
chargesum: 0.00000
title: Mulliken charges with hydrogens summed into heavy atoms:
elementType: S O O O N N C C C C C C C C C C
charge: 0.161031 -0.207391 -0.229433 -0.220678 -0.005841 -0.008472 0.132949 0.148925 -0.233383 0.187388 0.196800 -0.023140 -0.018998 0.150643 -0.055862 0.025464
polarizability: 1.65425875e+02 5.62910234e+00 1.48607988e+02 7.73971346e+00 -2.90848150e+00 1.33354117e+02
1716.lowfreq: -35.9169 -15.1589 -0.0005 0.0015 0.0017 2.2630 9.0426 35.9396 49.3538
frequency: -33.9971 35.8367 49.3398 58.7676 98.9747 116.2502 142.7574 147.5990 168.6515 179.8050 184.2358 196.1958 216.8154 235.7784 260.6335 277.2992 332.2099 347.8184 360.9276 364.3860 405.2395 437.7268 489.1286 504.1821 586.0645 611.3466 624.9160 641.6208 644.0759 689.9469 700.4309 738.2565 747.1207 781.0412 794.0489 815.5052 877.2649 922.9849 931.3740 956.4188 991.8981 993.5459 1012.7917 1039.8386 1042.6719 1072.4990 1129.1091 1153.0772 1172.8987 1181.2009 1238.3768 1248.1036 1255.8414 1284.4268 1306.8689 1314.0536 1325.5213 1363.2441 1374.1856 1376.5293 1391.4525 1395.4219 1408.3715 1417.0473 1465.4837 1468.8570 1470.8544 1471.8933 1481.9700 1483.4913 1489.2342 1613.8789 1650.7963 1677.0708 2970.9852 2984.8372 2988.9182 2993.0278 3019.1595 3063.9849 3075.7553 3077.0555 3081.0678 3082.9414 3100.4767 3103.1813 3107.9519 3145.1584 3520.4254 3522.4096
redmass: 2.2337 4.8843 4.9161 3.1900 2.5311 6.3228 4.2605 5.8910 9.7545 3.5985 2.5335 1.6243 1.1169 1.1689 3.4951 2.5719 3.7626 3.6641 7.3654 7.4152 2.4320 5.6522 9.1205 3.4676 6.5954 3.7946 4.3647 3.4491 2.7154 3.9383 5.3657 5.5988 1.7723 1.7152 1.1094 2.1257 3.4218 1.2718 3.1893 1.4096 3.3691 1.7646 2.5895 1.2678 1.7334 2.2325 2.3616 2.9845 2.0324 2.7461 1.2968 1.6525 1.2603 1.2745 1.4178 2.4676 1.5369 8.3591 1.6643 1.8612 1.2000 1.2064 1.1937 1.0928 1.0467 1.0453 1.0549 1.0720 1.0444 1.0492 1.0514 6.8496 8.4776 5.6145 1.0839 1.0354 1.0364 1.0366 1.0587 1.0582 1.0993 1.1008 1.0993 1.0980 1.0994 1.0993 1.1065 1.1070 1.0759 1.0780
irintensity: 0.0690 0.2979 0.7019 0.6020 1.8954 0.9508 0.3778 1.9007 10.3135 0.0348 0.9723 0.2510 0.0538 0.2287 1.8958 3.0081 5.8487 4.2404 17.8755 20.0377 1.6859 12.2214 14.3726 22.0730 0.0944 6.9857 2.0704 15.1382 2.6678 14.8880 6.2145 8.1053 10.2302 198.6600 8.9998 3.1102 12.7702 2.3570 12.1784 0.8958 9.1752 17.0455 0.6008 1.0930 17.5590 3.0014 1.0006 88.1051 4.5743 17.1798 22.2654 19.8254 11.3953 6.1288 7.8183 212.4832 63.3419 228.4174 13.6252 3.6146 10.3910 19.0916 40.9354 21.8207 7.6929 12.7972 9.6647 2.5620 11.4450 8.7764 11.2448 267.9377 113.1788 616.9931 17.6257 35.2262 15.3857 29.1445 18.1640 11.7877 4.1355 17.4666 18.0782 55.0099 12.8233 23.4218 30.0341 0.6208 83.1166 48.1996
temp: 298.150 k
press: 1.00000 atm
elementType: 16 8 8 8 7 7 6 6 6 6 6 6 6 6 6 6 1 1 1 1 1 1 1 1 1 1 1 1 1 1 1 1
symmnumber: 1
zpe: 671540.6 jmol-1
zpe.correction: 0.255776 hartree
zpe.thermalcorrener: 0.272734 hartree
zpe.thermalcorrenthalpy: 0.273678 hartree
zpe.thermalcorrgfe: 0.211124 hartree
zpe.sumelectzpe: -1122.708442 hartree
zpe.sumelectthermal: -1122.691485 hartree
zpe.sumelectthermalent: -1122.690541 hartree
zpe.sumelectthermalfe: -1122.753094 hartree
dipole: -0.4758 2.1316 2.0914
dipole: 3.0240
quadrupole: -100.1067 -105.5013 -111.8791
quadrupole: -7.1822 2.0086 2.5811
quadrupole: 5.7224 0.3277 -6.0501 -7.1822 2.0086 2.5811
hfenergy: -1122.9642185 hartree
pointgroup: C01 [X(C10H16N2O3S1)]
dipole: 0.0214147 1.0043904 -0.6373111 debye
polarizability: 166.5471142|-3.0756674|144.7367219|7.5333411|6.7101923|136.1041434 unknown
InChI: InChI=1S/C10H16N2O3S/c1-4-16-5-10(6(2)3)7(13)11-9(15)12-8(10)14/h6,11-12H,4-5H2,1-3H3
charge 0 multiplicity 1
32 atoms
S  -2.495191 -0.580643 1.014581
O  0.406586 0.084916 2.685536
O  -0.834578 0.070988 -1.937691
O  2.819978 -2.361063 -0.437763
N  1.657446 -1.030961 1.095826
N  1.056172 -1.019656 -1.18659
C  -0.021222 0.661747 0.321378
C  0.879657 1.985966 0.094373
C  -1.474759 0.994976 0.715238
C  0.650815 -0.117867 1.469771
C  -0.013441 -0.121843 -1.003482
C  0.462638 2.785903 -1.163295
C  0.877207 2.913868 1.333911
C  1.918319 -1.522151 -0.194503
C  -3.666805 -0.522206 -0.48638
C  -4.526584 -1.793619 -0.491696
H  1.916931 1.62126 -0.061365
H  -1.969969 1.56181 -0.087322
H  -1.494645 1.562298 1.655566
H  -0.577041 3.151008 -1.085824
H  1.120147 3.669621 -1.25425
H  0.54575 2.202331 -2.094521
H  -0.096275 3.423022 1.45027
H  1.64471 3.697202 1.195825
H  1.096564 2.378575 2.272095
H  2.193674 -1.465884 1.853777
H  1.148893 -1.450842 -2.112187
H  -4.290308 0.382869 -0.384414
H  -3.040423 -0.439099 -1.38894
H  -3.90103 -2.698565 -0.589944
H  -5.122191 -1.884165 0.434418
H  -5.227525 -1.769298 -1.3466
