program: Gaussian 09
title: 000052293
version: EM64L-G09RevD.01
frameworkgroup: C1[X(C18H30N2O2)]
method: RPBEPBE
basis: SDD
operation: Freq
keyword: #p
keyword: freq=noraman
keyword: PBEPBE/SDD
title: #p freq=noraman PBEPBE/SDD
converged: YES YES NO NO
title: Mulliken charges:
elementType: O O N N C C C C C C C C C C C C C C C C C C H H H H H H H H H H H H H H H H H H H H H H H H H H H H H H
charge: -0.320811 -0.266917 -0.367788 -0.684556 0.257186 -0.023581 -0.431210 -0.374838 -0.314937 -0.705953 -0.720538 -0.721526 -0.354254 -0.357722 -0.696807 0.195332 0.225459 -0.336476 -0.325744 -0.408121 -0.401964 0.500939 0.186219 0.184675 0.216856 0.272005 0.185054 0.202674 0.220795 0.245371 0.230690 0.212409 0.206206 0.232696 0.206675 0.210268 0.203041 0.228011 0.204217 0.188076 0.187550 0.195848 0.195757 0.209245 0.215689 0.209753 0.265719 0.255833 0.221673 0.219545 0.310801 0.311478
chargesum: 0.00000
title: Mulliken charges with hydrogens summed into heavy atoms:
elementType: O O N N C C C C C C C C C C C C C C C C C C
charge: -0.320811 -0.266917 -0.095783 -0.062277 0.257186 0.162638 -0.029678 0.012889 0.151229 -0.056648 -0.070899 -0.086258 0.021372 0.033883 -0.062121 0.195332 0.225459 -0.070756 -0.069911 -0.186448 -0.182420 0.500939
polarizability: 2.57029080e+02 2.21743027e+01 2.79600992e+02 1.43759059e+00 4.39550617e+00 1.49275590e+02
1716.lowfreq: -4.9929 -0.0006 0.0004 0.0007 2.2476 9.3191 16.4433 18.4216 22.8935
frequency: 16.3703 17.7090 22.4700 39.7609 53.6310 56.4609 61.4784 70.8746 102.0035 107.9658 119.7946 130.6337 142.0460 177.7556 184.7842 198.7442 216.8393 228.3919 232.6120 238.8651 241.6288 253.4775 287.4331 291.1391 312.2157 343.9846 363.9288 368.4101 392.4207 408.9550 413.4389 416.6140 417.0900 444.3456 457.8721 489.9088 508.6661 520.3514 552.0404 598.3146 611.4355 634.0566 676.6595 725.5147 742.9041 752.4881 755.0192 795.4558 824.0959 824.2009 829.4146 843.4667 859.7594 875.0796 898.6674 901.3478 918.1696 929.0836 936.9971 971.2886 977.4308 984.4658 990.2054 997.2406 1003.8179 1014.8399 1017.9110 1025.2024 1054.6333 1058.6812 1076.6567 1100.6258 1127.6035 1130.9912 1132.9031 1156.3433 1161.8737 1179.9083 1195.1164 1213.2296 1239.1237 1247.9306 1251.9925 1258.4279 1268.5528 1288.3344 1293.9626 1295.3578 1308.6878 1314.5713 1325.2045 1331.5162 1348.5375 1353.7215 1355.5475 1368.1753 1379.5774 1388.4140 1389.0656 1391.8333 1447.1896 1447.9699 1452.4741 1455.0041 1461.1856 1463.8603 1468.3146 1470.0917 1472.1222 1474.8407 1477.5399 1479.8894 1483.3489 1486.2234 1488.5904 1517.0902 1570.1091 1613.5101 1632.0305 1646.9867 2944.9535 2950.4207 2958.6225 2967.5899 2971.3758 2974.5186 2975.0548 2976.6070 2982.5278 2989.1597 3003.1808 3011.3680 3019.8504 3038.9759 3064.8476 3067.6677 3069.1005 3070.3635 3076.1631 3083.6747 3088.5043 3089.4060 3092.1179 3123.6582 3126.4597 3159.0028 3169.2385 3444.9655 3561.2377 3701.0281
redmass: 4.6110 4.6350 3.5354 3.3603 3.0125 2.0193 3.0011 4.2238 5.0602 3.4498 2.5977 1.8451 3.0361 1.8497 2.4802 1.4225 3.9388 2.2737 1.2551 2.3616 1.5508 1.0989 4.3827 4.6868 2.2146 3.0774 3.3053 2.5947 2.8621 1.1417 1.4042 1.8940 2.5744 2.0436 2.7749 2.3087 2.8317 3.6343 3.6604 2.6836 3.5785 6.8383 4.0461 1.0767 2.2706 1.4474 4.1918 4.2427 1.4099 1.4010 3.9473 1.8296 1.7372 2.1239 2.0709 2.5959 1.4480 1.2530 2.3355 1.3624 1.7069 1.3515 1.7959 3.1713 1.4255 2.2941 1.4802 1.4582 4.4299 2.7792 2.5123 2.2599 2.3319 1.2274 2.3594 2.0647 1.9170 1.1437 1.7641 1.7995 1.3618 2.1375 2.4732 1.6093 1.5503 1.0738 1.1951 1.2436 1.3184 1.2878 2.7283 1.3901 1.4802 1.6307 1.5278 1.2117 1.2265 1.2157 1.2144 4.8025 1.1964 3.6058 1.0876 1.0701 1.0584 1.0719 1.0592 1.0734 1.0624 1.0593 1.0426 1.0692 1.0654 1.0989 1.0896 3.1950 7.2713 10.3329 3.3017 1.4264 1.0627 1.0592 1.0610 1.0590 1.0367 1.0384 1.0355 1.0776 1.0366 1.0958 1.0978 1.0566 1.1023 1.1035 1.0987 1.1006 1.0990 1.0993 1.0998 1.1050 1.1008 1.0992 1.1004 1.0893 1.0891 1.0952 1.0951 1.0739 1.0451 1.1040
irintensity: 1.1285 0.3935 0.2842 0.4550 0.8479 0.2243 0.6995 1.2668 1.2309 0.5098 0.7505 0.0074 0.9924 0.5815 0.4896 0.6044 3.8271 0.5029 0.1175 0.6846 0.5880 1.3967 7.5936 7.3124 3.0564 0.3553 0.8697 1.1424 6.1905 76.0604 209.8963 22.4154 4.3546 6.1685 3.5029 6.3343 2.8916 3.5400 17.1416 52.0691 21.7177 1.3410 27.4155 11.2193 6.9171 0.4462 12.4136 12.9150 0.7092 3.9292 3.3805 68.5989 0.4856 4.8160 12.2570 5.1094 4.3060 4.2127 44.3337 0.0068 17.6179 0.2905 0.6201 46.8024 5.6271 1.2636 17.4396 7.5867 422.1138 3.9494 2.2211 5.9713 31.4309 17.2056 5.9815 36.2880 3.2880 188.8617 7.6180 22.9719 28.2343 82.7196 279.7704 29.1859 12.8412 0.5600 0.2674 0.9022 2.6942 4.1198 85.8115 18.2969 14.3799 2.2246 27.7745 31.5763 27.9050 9.7723 18.2412 11.7731 49.2110 5.5325 0.6846 6.9075 1.1204 0.5574 4.9878 6.2056 6.1248 27.3773 13.1928 6.0063 8.6560 1.2282 23.0595 68.4712 26.9466 361.7350 94.4332 313.3395 8.5299 2.8539 20.7705 90.2495 33.8906 45.1942 16.4816 23.7582 34.5865 2.9303 5.7012 23.7889 1.8284 108.7733 25.1665 89.8488 44.9906 59.6513 49.3934 27.9259 21.5957 47.2375 48.9737 14.1469 21.7406 10.7980 4.4396 5.1554 109.4207 23.2438
temp: 298.150 k
press: 1.00000 atm
elementType: 8 8 7 7 6 6 6 6 6 6 6 6 6 6 6 6 6 6 6 6 6 6 1 1 1 1 1 1 1 1 1 1 1 1 1 1 1 1 1 1 1 1 1 1 1 1 1 1 1 1 1 1
symmnumber: 1
zpe: 1181699.7 jmol-1
zpe.correction: 0.450086 hartree
zpe.thermalcorrener: 0.475822 hartree
zpe.thermalcorrenthalpy: 0.476766 hartree
zpe.thermalcorrgfe: 0.391752 hartree
zpe.sumelectzpe: -962.151240 hartree
zpe.sumelectthermal: -962.125504 hartree
zpe.sumelectthermalent: -962.124559 hartree
zpe.sumelectthermalfe: -962.209573 hartree
dipole: 0.0748 5.2549 -0.5530
dipole: 5.2845
quadrupole: -122.0539 -119.6994 -140.5565
quadrupole: 27.4356 3.1368 5.0163
quadrupole: 5.3827 7.7372 -13.1199 27.4356 3.1368 5.0163
hfenergy: -962.6013253 hartree
pointgroup: C01 [X(C18H30N2O2)]
dipole: 0.0108848 -2.0594506 -0.2847607 debye
polarizability: 256.2971961|21.8502782|280.4125662|2.796402|0.571251|149.1958997 unknown
InChI: InChI=1S/C18H30N2O2/c1-5-6-7-8-14(2)20-18(3,4)13-22-17(21)15-9-11-16(19)12-10-15/h9-12,14,20H,5-8,13,19H2,1-4H3
charge 0 multiplicity 1
52 atoms
O  -1.148148 1.3660 -0.167043
O  -3.281196 2.310027 -0.119084
N  1.467114 1.817001 0.763464
N  -4.5585 -4.076844 -0.060297
C  0.947717 2.612116 -0.385125
C  2.901801 1.423668 0.816423
C  3.089292 -0.078447 0.451224
C  4.554067 -0.568252 0.381039
C  -0.574764 2.7404 -0.170989
C  1.533584 4.04732 -0.333382
C  1.228421 1.977391 -1.782705
C  3.486089 1.760167 2.209585
C  4.674392 -2.032625 -0.099911
C  6.133656 -2.538681 -0.162458
C  6.244804 -4.005096 -0.632622
C  -2.552424 1.283494 -0.13189
C  -3.030336 -0.116276 -0.115704
C  -4.431542 -0.353427 -0.066531
C  -2.150006 -1.232467 -0.147633
C  -4.943043 -1.657962 -0.047884
C  -2.650452 -2.542809 -0.129688
C  -4.058486 -2.779724 -0.078898
H  3.451563 2.024949 0.063108
H  2.537232 -0.690183 1.19834
H  2.601316 -0.260948 -0.527794
H  0.842489 1.025595 0.96888
H  5.128753 0.08992 -0.304991
H  5.033149 -0.476626 1.376158
H  -1.05252 3.325495 -0.976797
H  -0.794938 3.211144 0.803743
H  1.324956 4.510396 0.646935
H  2.62908 4.027292 -0.474231
H  1.105723 4.680774 -1.132554
H  0.743895 0.988896 -1.86487
H  0.842109 2.620952 -2.595819
H  2.315012 1.853354 -1.94304
H  2.991256 1.151966 2.990546
H  3.300301 2.822315 2.443989
H  4.574942 1.571799 2.260265
H  4.20973 -2.130485 -1.103635
H  4.089273 -2.689552 0.577851
H  6.597877 -2.434673 0.839748
H  6.71658 -1.885013 -0.84322
H  5.695281 -4.681936 0.048857
H  7.297391 -4.34185 -0.666384
H  5.817257 -4.130852 -1.645482
H  -5.103386 0.511266 -0.043012
H  -1.070896 -1.058026 -0.188425
H  -6.026533 -1.823183 -0.0092
H  -1.959588 -3.39437 -0.155271
H  -3.933651 -4.877795 -0.081423
H  -5.559195 -4.249397 -0.024165
