program: Gaussian 09
title: 000006722
version: EM64L-G09RevD.01
frameworkgroup: C1[X(C10H9NO3S)]
method: RPBEPBE
basis: SDD
operation: Freq
keyword: #p
keyword: freq=noraman
keyword: PBEPBE/SDD
title: #p freq=noraman PBEPBE/SDD
converged: YES YES NO NO
title: Mulliken charges:
elementType: S O O O N C C C C C C C C C C H H H H H H H H H
charge: 0.943496 -0.599436 -0.507713 -0.474743 -0.708265 0.274028 -0.190222 0.464646 0.345219 -0.291929 -0.435621 -0.488001 -0.244881 -0.428193 -0.216995 0.302943 0.248613 0.243885 0.246030 0.218666 0.228632 0.378817 0.307922 0.383104
chargesum: 0.00000
title: Mulliken charges with hydrogens summed into heavy atoms:
elementType: S O O O N C C C C C C C C C C
charge: 0.943496 -0.216332 -0.507713 -0.474743 -0.021526 0.274028 -0.190222 0.464646 0.345219 0.011013 -0.187009 -0.244116 0.001149 -0.209527 0.011637
polarizability: 2.12737119e+02 3.34651274e+00 1.87908335e+02 -8.01133348e+00 -2.80148593e+00 7.90523752e+01
1716.lowfreq: -2.6967 -0.0020 -0.0019 -0.0010 6.4245 9.5530 58.2222 84.0998 140.6359
frequency: 58.2168 84.0966 140.6350 159.0431 168.3848 217.5942 232.9612 238.8715 247.9978 257.0102 288.1712 324.9264 371.6891 409.9224 437.2152 460.0100 469.2994 475.7367 493.4591 501.1881 529.1438 583.1150 585.1842 631.2302 720.2309 733.8554 754.2476 767.8747 776.9207 831.6424 832.3111 868.3940 876.6663 931.1111 965.6747 969.4426 989.8559 1002.0320 1017.5748 1080.4205 1088.1771 1134.7379 1157.8003 1183.4527 1194.8456 1240.7215 1337.9327 1380.3384 1383.8044 1402.6039 1435.3730 1468.5739 1504.6282 1586.0869 1590.4126 1611.7787 1700.1966 3125.2801 3136.3016 3141.2170 3152.2794 3163.4065 3172.2673 3359.0408 3505.3313 3630.9636
redmass: 6.7838 6.8366 6.9372 5.1729 4.5726 6.1453 6.6617 2.6304 4.7739 5.0303 2.4842 3.1783 4.7304 9.6616 1.4128 4.2841 4.4177 3.2094 5.6900 8.1878 5.1885 5.3857 4.4196 3.1124 2.0641 1.8876 1.6490 1.6582 3.5750 2.7076 5.0274 1.4453 5.6484 1.4034 4.6825 1.5042 1.3927 1.4614 2.2267 2.1513 2.7680 1.4766 1.4575 1.2361 1.3938 1.7021 1.7430 2.5747 4.2912 4.1305 2.3723 3.4472 4.8347 5.3649 7.1941 6.4895 1.1243 1.0871 1.0884 1.0898 1.0908 1.0999 1.0992 1.0639 1.0664 1.0893
irintensity: 0.5692 0.2829 3.1913 0.0944 11.5597 6.0842 3.5831 2.7692 3.5371 5.4806 31.4249 54.2938 32.3176 40.4369 45.4402 39.6306 12.8329 6.6847 3.3506 85.4014 52.3542 13.2727 11.6598 3.3490 80.0532 127.9028 14.6853 11.0198 2.2667 107.1442 33.3105 2.6280 2.9486 0.7253 77.4371 17.3976 3.0361 68.1443 6.4771 2.5963 5.2765 11.8484 10.4988 7.6735 22.1838 4.9376 17.2111 28.9224 35.5004 25.1463 0.3963 64.6724 11.5653 32.9545 114.2452 4.8014 119.5682 10.7197 3.4936 11.6734 11.4251 25.2969 16.5279 274.9838 59.3051 51.0180
temp: 298.150 k
press: 1.00000 atm
elementType: 16 8 8 8 7 6 6 6 6 6 6 6 6 6 6 1 1 1 1 1 1 1 1 1
symmnumber: 1
zpe: 450220.0 jmol-1
zpe.correction: 0.171480 hartree
zpe.thermalcorrener: 0.185105 hartree
zpe.thermalcorrenthalpy: 0.186049 hartree
zpe.thermalcorrgfe: 0.132067 hartree
zpe.sumelectzpe: -1063.707692 hartree
zpe.sumelectthermal: -1063.694067 hartree
zpe.sumelectthermalent: -1063.693123 hartree
zpe.sumelectthermalfe: -1063.747105 hartree
dipole: -2.9714 -0.5594 -1.9126
dipole: 3.5777
quadrupole: -90.9970 -76.9385 -104.0718
quadrupole: -5.2320 -7.8253 3.4415
quadrupole: -0.3279 13.7306 -13.4027 -5.2320 -7.8253 3.4415
hfenergy: -1063.8791717 hartree
pointgroup: C01 [X(C10H9N1O3S1)]
dipole: -1.175536 0.1820799 0.7525134 debye
dipolederiv: 1.8571886 0.1854784 0.0487834 0.4355485 1.195761 0.107968 0.1465649 0.1557809 1.4821877 -0.6077095 -0.0885326 -0.195412 -0.136562 -0.6842936 -0.2219425 -0.3767414 -0.2568863 -0.8834336 -0.8137607 0.0839486 0.0349857 0.060717 -0.5024187 -0.0345466 -0.0071708 0.0292281 -0.4484301 -0.606558 -0.0845812 0.0169558 -0.1524835 -0.4695736 0.1349876 0.0688721 0.0675444 -0.5498751 -0.9007979 -0.6075613 -0.0808667 -0.4316033 -0.6927626 -0.1868347 -0.0527434 -0.2121222 -0.5709519 -0.2070618 0.2774214 0.004277 -0.8203662 -0.1589648 -0.0449163 -0.0317485 0.0614294 -0.028483 -0.0004074 -0.1805415 -0.0713928 -0.0286657 0.0030016 -0.0098004 0.079874 0.0346118 -0.1449075 0.2627939 -0.4568293 0.0213454 0.1680732 -0.1039488 -0.0069883 0.0752854 -0.0758657 0.0886767 0.6061342 0.8029204 0.2288225 0.6418179 0.5799119 0.2041237 0.1533346 0.2920813 0.2046552 -0.1917524 0.0305479 0.0265156 0.2595317 -0.1260103 0.0039622 -0.0348367 -0.0101206 -0.1093117 0.197846 0.1058919 0.0301143 -0.0734981 0.0553943 0.0012898 0.0219092 0.022056 -0.1299554 -0.2004108 0.2281789 0.0104062 0.1193321 -0.3528266 -0.0232226 0.0036176 0.002728 -0.2509442 -0.1836278 0.0034687 -0.0002701 0.0094579 0.1269101 -0.0057737 -0.0105646 -0.015899 -0.1547438 -0.2758145 -0.4611177 -0.0767582 0.1511805 0.0752806 0.0513661 -0.0753602 -0.1020592 -0.2512653 0.2149341 0.1711056 0.0752116 -0.0806961 0.3762866 0.0250589 0.0767412 0.0299893 -0.0922973 0.0876961 0.0429354 0.0018984 0.0147359 0.1460689 -0.0004381 0.0127084 -0.0059191 0.1611216 -0.039452 -0.1152931 -0.0121824 -0.0442975 0.041304 -0.0002226 -0.0189101 0.0019784 0.1471555 -0.0266784 -0.0525273 -0.0194905 -0.1094707 -0.0022836 -0.0096325 -0.0377471 0.0122026 0.1753542 0.0596168 0.0090173 0.0000408 -0.0071935 -0.096241 0.0115018 0.0095692 0.0064801 0.1687509 0.0767882 -0.0148665 -0.0143992 0.0365589 -0.1317475 -0.0198979 -0.0129571 -0.0491449 0.1573575 -0.096075 0.0822579 -0.0338909 0.0927352 0.0663287 0.0125272 -0.0276684 0.0224734 0.1497858 0.5121588 -0.0349438 -0.0491225 -0.1279303 0.1787606 0.0231607 0.0387058 -0.0042245 0.2705456 0.1424455 0.0568508 -0.0545798 0.0647445 0.1947008 0.0119871 -0.0420443 0.0244228 0.3209433 0.1325039 0.0167713 0.1090084 -0.0416664 0.2813622 -0.0237168 0.0413104 -0.0307654 0.2880649 unknown
polarizability: 212.6763106|-3.4838844|187.9092167|8.772387|1.4718225|79.112302 unknown
InChI: InChI=1S/C10H9NO3S/c11-8-5-1-3-7-4-2-6-9(10(7)8)15(12,13)14/h1-6,12H,11H2
charge 0 multiplicity 1
24 atoms
S  2.418508 0.13494 -0.240638
O  2.576063 1.093983 1.402537
O  3.580202 -0.99351 -0.210717
O  2.422796 1.22045 -1.433089
N  0.232773 2.349292 0.530545
C  -0.540415 0.023201 0.076343
C  0.714716 -0.676576 0.071332
C  -1.712466 -0.850752 -0.032416
C  -0.768924 1.458231 0.195982
C  0.867032 -2.062279 0.106465
C  -1.552463 -2.276508 0.008701
C  -3.01909 -0.295063 -0.186385
C  -0.301309 -2.877913 0.113335
C  -2.081655 1.952197 -0.02302
C  -3.185135 1.092751 -0.226688
H  1.866617 -2.507781 0.090054
H  -2.455617 -2.894507 -0.050808
H  -3.875756 -0.970786 -0.274963
H  -0.19766 -3.966027 0.155027
H  -2.242916 3.035939 0.021574
H  -4.180094 1.526057 -0.37435
H  1.130043 2.06462 0.944274
H  0.032264 3.345274 0.477703
H  3.532886 1.36767 1.490201
