program: Gaussian 09
title: 000052215
version: EM64L-G09RevD.01
frameworkgroup: C1[X(C19H13Cl2NO)]
method: RPBEPBE
basis: SDD
operation: Freq
keyword: #p
keyword: freq=noraman
keyword: PBEPBE/SDD
title: #p freq=noraman PBEPBE/SDD
converged: YES YES NO NO
title: Mulliken charges:
elementType: Cl Cl O N C C C C C C C C C C C C C C C C C C C H H H H H H H H H H H H H
charge: -0.025064 -0.060469 -0.219929 -0.324828 0.453461 0.470292 0.045741 0.285439 -0.335989 -0.316015 -0.311965 -0.313307 -0.372177 -0.325449 -0.205526 -0.207760 -0.230106 -0.222733 -0.117455 -0.227495 -0.226787 -0.236079 -0.230050 0.258077 0.269483 0.263284 0.266691 0.253558 0.253787 0.256026 0.259144 0.238262 0.238672 0.232581 0.232522 0.232163
chargesum: 0.00000
title: Mulliken charges with hydrogens summed into heavy atoms:
elementType: Cl Cl O N C C C C C C C C C C C C C C C C C C C
charge: -0.025064 -0.060469 -0.219929 -0.324828 0.453461 0.470292 0.045741 0.285439 -0.077913 -0.046532 -0.311965 -0.050023 -0.105486 -0.071890 0.048261 0.048266 0.029038 0.015530 -0.117455 0.011177 0.005794 -0.003557 0.002113
polarizability: 3.23708871e+02 -5.28360587e+00 2.14773689e+02 1.38688463e+01 -2.18727932e+00 1.71969143e+02
1716.lowfreq: -10.7248 -5.4909 -2.9455 -0.0009 0.0009 0.0021 25.7733 34.7735 39.6991
frequency: 25.6585 34.7704 39.6897 45.5735 51.8586 69.2326 99.2061 113.6255 137.1792 159.0309 184.9784 209.7280 221.1393 249.1041 283.9513 320.7980 335.2919 369.6229 402.6312 405.1409 409.2224 410.5962 430.8904 460.5199 483.5690 516.6838 526.9544 559.2619 613.0913 623.6395 636.2861 642.5072 676.0461 695.8670 699.5177 708.0092 719.0947 724.6352 762.9264 787.5530 814.1355 815.6103 842.0705 858.8734 866.3044 931.1023 941.0374 944.7661 949.7530 958.5207 984.9024 986.9742 989.9507 995.8057 1002.6342 1021.6117 1025.1076 1041.8657 1073.8522 1080.5214 1091.7420 1119.5160 1127.1683 1172.5669 1174.1858 1187.6330 1190.1442 1213.1329 1249.2522 1268.0565 1290.2797 1299.3057 1319.4414 1363.0298 1375.9919 1382.6523 1403.9956 1425.7220 1433.6662 1463.7385 1476.2272 1479.9418 1562.2313 1573.2328 1587.4576 1592.4381 1595.9744 1604.7028 1609.0321 3128.8967 3139.2154 3141.1174 3150.8213 3151.6742 3152.3409 3159.9051 3165.0409 3165.9349 3169.9558 3174.3298 3177.8880 3191.2537
redmass: 7.1152 6.7167 9.0860 6.2886 4.0240 5.0197 7.1833 8.4213 5.7906 6.0359 6.6164 8.5399 7.8871 7.4888 5.3572 6.0872 6.1931 7.0018 4.2665 5.9582 2.9415 3.8883 6.5839 3.6271 4.3346 4.7665 4.0243 4.8758 6.4458 6.8857 6.6098 6.1171 6.4711 5.6707 3.7152 1.6298 5.6602 4.3637 1.3137 2.3404 1.2740 1.8363 2.9682 1.2467 1.4561 3.0566 1.4600 1.6955 1.4217 1.3701 1.3954 1.3398 5.5639 4.2210 1.3449 3.8086 3.3816 2.1518 2.9617 1.9450 2.1300 1.3701 1.5818 1.0564 1.0555 1.1410 1.1195 3.5322 1.6570 4.5218 2.6911 1.3955 1.3259 8.5379 7.7167 8.7033 3.4461 2.2511 2.2353 2.7242 2.3100 2.3068 9.1054 6.6762 7.3689 6.8897 6.7021 6.9553 6.1062 1.0851 1.0883 1.0861 1.0926 1.0904 1.0887 1.0963 1.0952 1.0901 1.1014 1.0966 1.1005 1.0965
irintensity: 0.6856 0.2786 0.4066 0.6937 0.4908 0.3814 1.7248 0.3863 0.4731 1.4124 0.5424 0.3175 1.7574 1.0410 3.3880 0.6534 2.3820 1.4812 0.4240 15.5941 0.3910 9.9166 3.2482 16.2500 19.4961 2.9877 5.8699 12.7839 0.1475 1.0049 9.5641 11.3511 29.3613 8.6422 3.0667 82.5222 10.3570 5.2004 69.9050 35.7719 0.3657 46.7475 29.6949 2.6278 5.0851 0.4731 3.4724 4.2469 0.9193 1.3346 3.1070 0.1590 1.9357 42.1465 0.2786 23.6915 31.0902 5.9011 78.3860 21.2118 5.3249 5.8373 7.9694 0.0288 0.3198 6.0385 16.6805 8.4070 17.1028 440.9120 151.8668 3.4009 0.6963 0.7604 0.3767 0.4874 5.1639 15.4857 9.4889 75.8587 141.5709 58.8654 142.3544 26.8551 0.5875 25.2925 0.2860 15.5156 5.9780 0.0691 6.7429 1.2053 15.0816 9.3817 2.2279 15.7088 6.8492 3.3026 22.1964 3.1712 11.5219 0.9303
temp: 298.150 k
press: 1.00000 atm
elementType: 17 17 8 7 6 6 6 6 6 6 6 6 6 6 6 6 6 6 6 6 6 6 6 1 1 1 1 1 1 1 1 1 1 1 1 1
symmnumber: 1
zpe: 691868.1 jmol-1
zpe.correction: 0.263519 hartree
zpe.thermalcorrener: 0.283089 hartree
zpe.thermalcorrenthalpy: 0.284033 hartree
zpe.thermalcorrgfe: 0.213016 hartree
zpe.sumelectzpe: -1780.343868 hartree
zpe.sumelectthermal: -1780.324298 hartree
zpe.sumelectthermalent: -1780.323354 hartree
zpe.sumelectthermalfe: -1780.394371 hartree
dipole: -4.7630 3.9092 -1.0004
dipole: 6.2424
quadrupole: -144.2435 -141.7581 -139.8922
quadrupole: -0.6694 2.6377 -5.5824
quadrupole: -2.2789 0.2065 2.0724 -0.6694 2.6377 -5.5824
hfenergy: -1780.607387 hartree
pointgroup: C01 [X(C19H13Cl2N1O1)]
dipole: -1.8692185 -1.5904175 0.0914089 debye
polarizability: 321.221439|9.724244|212.7552446|-22.4322987|8.7083448|176.4750192 unknown
InChI: InChI=1S/C19H13Cl2NO/c20-15-10-12-16(13-11-15)22(18-9-5-4-8-17(18)21)19(23)14-6-2-1-3-7-14/h1-13H
charge 0 multiplicity 1
36 atoms
Cl 0.398709 -1.111443 -2.627964
Cl 6.360243 0.56268 -0.337088
O  0.107262 2.346265 1.171937
N  0.308785 0.22396 0.183377
C  1.750353 0.316797 0.078851
C  -0.282938 -1.089252 0.096105
C  -0.451465 1.339979 0.646272
C  -1.942516 1.297763 0.453278
C  2.561155 -0.778836 0.46382
C  2.35857 1.491875 -0.430447
C  -0.274777 -1.84378 -1.10463
C  -0.857113 -1.681468 1.249783
C  -2.751636 1.897101 1.452688
C  -2.546942 0.798506 -0.72949
C  3.965195 -0.711201 0.334567
C  3.759699 1.57085 -0.551852
C  -0.811559 -3.142792 -1.16676
C  -1.419201 -2.973932 1.198999
C  4.545974 0.465509 -0.170638
C  -1.389765 -3.709862 -0.007642
C  -4.151129 1.959668 1.292266
C  -3.94624 0.880367 -0.895977
C  -4.752887 1.448454 0.117518
H  2.10572 -1.688802 0.865701
H  1.744631 2.346081 -0.722536
H  -0.852875 -1.109951 2.183826
H  -2.266898 2.321089 2.338349
H  -1.929059 0.378769 -1.529709
H  4.590506 -1.558567 0.629352
H  4.229902 2.477237 -0.943379
H  -0.788913 -3.694645 -2.110983
H  -1.865537 -3.408137 2.099265
H  -1.81389 -4.718038 -0.054585
H  -4.770489 2.413421 2.073537
H  -4.405427 0.50643 -1.817577
H  -5.839546 1.503805 -0.012134
