program: Gaussian 09
title: 000052106
version: EM64L-G09RevD.01
frameworkgroup: C1[X(C16H19NO4)]
method: RPBEPBE
basis: SDD
operation: Freq
keyword: #p
keyword: freq=noraman
keyword: PBEPBE/SDD
title: #p freq=noraman PBEPBE/SDD
converged: YES YES NO NO
title: Mulliken charges:
elementType: O O O O N C C C C C C C C C C C C C C C C H H H H H H H H H H H H H H H H H H H
charge: -0.276081 -0.297580 -0.225563 -0.296293 -0.399593 -0.047127 -0.191895 -0.703312 -0.716048 0.212945 0.289336 -0.419909 0.474399 -0.338220 -0.379593 -0.391193 -0.224695 -0.225220 -0.232089 0.193891 -0.442011 0.234548 0.296666 0.232623 0.214085 0.221772 0.220889 0.225000 0.218071 0.351926 0.229109 0.233164 0.260896 0.261555 0.235413 0.233789 0.227764 0.227930 0.230048 0.280606
chargesum: 0.00000
title: Mulliken charges with hydrogens summed into heavy atoms:
elementType: O O O O N C C C C C C C C C C C C C C C C
charge: -0.276081 -0.297580 -0.225563 -0.296293 -0.047667 0.187421 0.104771 -0.034833 -0.052088 0.212945 0.289336 0.042363 0.474399 0.184231 -0.144180 -0.157404 0.003069 0.002711 -0.002042 0.193891 -0.161406
polarizability: 2.13163488e+02 2.71421311e+01 2.06565846e+02 2.08544832e+01 4.36158849e+00 1.50749657e+02
1716.lowfreq: -19.1274 -9.7995 -3.5678 -0.0004 -0.0003 0.0006 4.4549 6.8292 13.6032
frequency: -17.5485 -7.4201 13.3624 29.9797 45.2017 46.5432 55.9958 64.2148 74.5756 104.3213 123.0721 136.0284 173.8692 194.5902 203.7057 227.9400 233.3357 254.5701 264.8741 287.5661 299.3581 308.0093 319.3191 364.2253 391.1867 402.5260 451.3495 498.3919 517.6919 553.0285 588.7712 594.0100 616.8786 640.7062 644.2324 680.3100 685.6509 697.5292 702.6857 721.9423 758.5650 814.9239 836.0259 847.0500 853.8690 880.6705 911.1585 921.2439 932.9406 948.5538 952.3396 957.7046 967.6965 977.1138 977.8643 991.1553 994.6454 997.3060 1026.5886 1065.4500 1088.5287 1117.5484 1146.9631 1172.9216 1175.4096 1185.8807 1189.9046 1192.7046 1194.5593 1210.1907 1228.3999 1257.1852 1288.8573 1320.4163 1325.2866 1338.0058 1344.8845 1357.5019 1380.9919 1385.8987 1399.5203 1439.8618 1456.8459 1460.3686 1471.9535 1475.4130 1479.5408 1482.9772 1487.2311 1489.8672 1596.2809 1617.5611 1638.5546 1652.2319 2158.0676 2976.2157 2984.1514 2996.3155 3006.0050 3012.3883 3024.3338 3063.4516 3070.0705 3075.2518 3075.4084 3081.1416 3088.2973 3121.8723 3124.8880 3136.4524 3149.0846 3164.9090 3425.8437 3568.1760
redmass: 4.2447 3.7779 4.1532 4.7703 4.5493 6.1385 3.4756 4.6815 5.1519 3.7116 5.5969 4.9232 4.8835 1.7705 1.7004 1.5358 2.1913 7.4584 4.8723 4.5728 3.0947 3.1665 2.2465 5.7238 2.4996 2.7968 4.2604 5.1494 2.9249 5.8006 5.4462 1.3617 6.3357 1.2387 2.9756 6.7276 1.2807 8.9488 1.8868 5.1370 2.0410 3.7858 4.0097 6.6939 1.2470 4.7541 3.5624 1.2475 1.7462 2.0930 1.7634 1.5455 1.7173 1.3927 4.7500 6.0073 3.9479 1.3313 2.1755 1.9448 1.5146 2.5807 4.2288 1.0541 2.4283 1.4473 1.6687 1.0925 1.0920 2.3856 2.3722 1.2124 1.2905 1.4333 1.2752 1.4119 1.3946 1.4396 1.2087 8.6821 1.2132 2.1887 1.0818 1.0493 1.0641 1.1405 1.0461 1.5410 1.6631 1.4579 6.1392 6.1983 11.6624 9.5755 6.0080 1.0357 1.0356 1.0841 1.0565 1.0576 1.0836 1.1054 1.0997 1.1005 1.1069 1.0990 1.0998 1.0854 1.0879 1.0921 1.0964 1.1017 1.1611 1.0772
irintensity: 0.0696 0.0133 0.1273 0.3533 0.8644 0.6432 2.0910 4.1983 1.9999 0.4203 1.3905 0.9965 4.6977 3.9887 3.1657 0.6184 2.9786 20.3683 7.8910 1.8569 0.5593 7.7072 0.9736 1.8307 4.5045 0.0169 2.4814 21.4355 9.2639 6.1567 9.0306 89.7366 0.2532 72.1939 28.8946 3.2586 62.4871 20.9996 42.5301 27.5636 66.5116 3.4981 29.7533 3.8709 0.0286 5.3003 123.9672 29.8465 5.0375 2.2953 6.9228 28.0520 2.3068 0.0178 234.6892 0.3955 112.7711 0.0105 2.3659 78.9545 6.6103 32.6466 178.4298 0.0102 91.1917 98.1247 109.0002 0.8548 8.6841 189.8143 11.7980 5.6038 80.5808 11.6240 0.2999 3.5333 35.4509 2.6886 20.6472 0.3680 13.9582 9.2354 5.0188 7.0056 12.4286 63.2421 18.6035 236.8826 7.6495 170.7709 0.6685 0.1302 222.3211 243.7357 1.4654 24.9442 22.8507 8.0668 10.4711 24.8620 11.5558 6.4889 32.3405 2.9996 20.3615 74.2830 29.0121 4.2567 1.5298 16.1684 40.6350 19.9564 63.3631 53.4699
temp: 298.150 k
press: 1.00000 atm
elementType: 8 8 8 8 7 6 6 6 6 6 6 6 6 6 6 6 6 6 6 6 6 1 1 1 1 1 1 1 1 1 1 1 1 1 1 1 1 1 1 1
symmnumber: 1
zpe: 832463.2 jmol-1
zpe.correction: 0.317069 hartree
zpe.thermalcorrener: 0.337793 hartree
zpe.thermalcorrenthalpy: 0.338737 hartree
zpe.thermalcorrgfe: 0.264769 hartree
zpe.sumelectzpe: -975.131702 hartree
zpe.sumelectthermal: -975.110977 hartree
zpe.sumelectthermalent: -975.110033 hartree
zpe.sumelectthermalfe: -975.184002 hartree
dipole: 1.0309 2.5245 2.3184
dipole: 3.5792
quadrupole: -117.8271 -113.8881 -123.2951
quadrupole: -0.3435 -2.5562 -6.6312
quadrupole: 0.5097 4.4486 -4.9583 -0.3435 -2.5562 -6.6312
hfenergy: -975.4487704 hartree
pointgroup: C01 [X(C16H19N1O4)]
dipole: 0.4961351 -0.737878 -1.0919529 debye
polarizability: 217.8657056|-21.5518429|199.3393539|-24.6727937|13.6718284|153.2739322 unknown
InChI: InChI=1S/C16H19NO4/c1-4-10-20-15(18)14(12(2)3)17-16(19)21-11-13-8-6-5-7-9-13/h1,5-9,12,14,17H,10-11H2,2-3H3
charge 0 multiplicity 1
40 atoms
O  -2.717119 -1.376626 -0.281669
O  1.160017 0.69988 0.368076
O  -4.510939 -0.432886 0.869744
O  -0.181028 1.87772 1.915486
N  -1.097893 0.670535 0.114737
C  -3.177328 2.042824 -0.418477
C  -2.495416 0.929626 0.463345
C  -2.466489 3.397211 -0.208432
C  -3.214154 1.655596 -1.914126
C  -3.352667 -0.336392 0.408924
C  -0.067103 1.149007 0.893613
C  2.3668 1.165183 1.129606
C  3.578196 0.541119 0.481935
C  -3.525734 -2.636948 -0.409135
C  4.013566 -0.751984 0.867458
C  4.298343 1.238099 -0.520383
C  5.144715 -1.340262 0.260005
C  5.430878 0.653644 -1.130269
C  5.856352 -0.63768 -0.740798
C  -2.811247 -3.555116 -1.293208
C  -2.245075 -4.362696 -2.030754
H  -4.217352 2.120341 -0.042623
H  -2.509163 1.288895 1.510119
H  -2.436883 3.682195 0.858083
H  -2.991273 4.192748 -0.76845
H  -1.424427 3.35496 -0.573617
H  -3.716232 2.447463 -2.498478
H  -3.761147 0.710993 -2.090736
H  -2.190217 1.542277 -2.317007
H  -0.880425 0.000614 -0.624536
H  2.391468 2.26877 1.089752
H  2.244641 0.85828 2.183509
H  -3.658843 -3.062095 0.602287
H  -4.524284 -2.374012 -0.803656
H  3.461785 -1.297685 1.642361
H  3.969011 2.239368 -0.823714
H  5.472832 -2.339695 0.566516
H  5.980726 1.202459 -1.902903
H  6.736458 -1.091257 -1.2105
H  -1.743448 -5.062276 -2.674983
