program: Gaussian 09
title: 000052095
version: EM64L-G09RevD.01
frameworkgroup: C1[X(C14H20N2O2)]
method: RPBEPBE
basis: SDD
operation: Freq
keyword: #p
keyword: freq=noraman
keyword: PBEPBE/SDD
title: #p freq=noraman PBEPBE/SDD
converged: YES YES NO NO
title: Mulliken charges:
elementType: O O N N C C C C C C C C C C C C C C H H H H H H H H H H H H H H H H H H H H
charge: -0.244089 -0.245585 -0.082305 -0.362002 -0.357310 -0.364193 -0.443016 -0.448703 -0.337922 -0.396906 0.150260 0.149396 0.192710 -0.365001 -0.360885 -0.251029 -0.224968 -0.536824 0.172868 0.234191 0.215268 0.177846 0.204049 0.230822 0.224909 0.213683 0.164616 0.257304 0.260351 0.222364 0.310853 0.250373 0.241198 0.229914 0.226465 0.251079 0.224507 0.215715
chargesum: 0.00000
title: Mulliken charges with hydrogens summed into heavy atoms:
elementType: O O N N C C C C C C C C C C C C C C
charge: -0.244089 -0.245585 -0.082305 -0.051149 0.049749 0.028920 -0.008145 -0.010112 0.083997 0.085808 0.150260 0.149396 0.192710 -0.114627 -0.119687 -0.021114 0.001497 0.154476
polarizability: 2.24785048e+02 4.37665349e+00 1.71315704e+02 1.15600013e+00 -2.25438747e+00 1.19486858e+02
1716.lowfreq: -20.9328 -8.8233 -2.8358 -0.0009 -0.0007 -0.0005 12.2378 22.9987 24.7280
frequency: -11.9551 21.2503 24.0705 32.8289 51.8797 73.8912 90.7869 100.8408 122.1155 144.8989 184.3141 215.9238 242.5603 258.5060 275.8735 286.6900 331.6506 363.4249 382.1717 404.1359 449.6800 498.4269 542.3827 560.8571 566.4666 610.0173 635.6995 654.9125 705.9315 742.6523 757.9673 760.5548 769.8972 780.6159 837.9943 843.4717 854.0257 868.0265 901.3858 937.6860 953.5120 965.8372 975.1501 984.7115 994.4155 1042.0117 1046.6005 1063.1223 1084.9979 1096.0700 1108.8151 1112.3778 1144.3746 1146.6280 1148.7152 1160.8552 1176.3442 1186.8437 1196.9048 1215.6167 1229.5065 1236.2699 1242.6657 1260.7174 1277.7309 1287.3974 1290.7685 1299.6427 1309.5502 1337.1120 1348.3826 1380.8875 1381.4922 1421.7720 1442.0596 1445.7204 1464.4509 1466.0103 1467.3631 1470.0954 1476.0231 1479.1003 1480.3374 1488.8346 1497.4094 1586.0847 1596.5703 1612.7251 2819.0488 2828.2034 2846.4651 2959.9804 3010.7300 3013.3004 3021.1594 3026.5848 3042.8220 3045.6022 3049.2720 3067.5572 3086.9962 3091.7777 3126.5133 3129.6129 3135.6038 3158.4478 3170.8332 3557.5361
redmass: 2.1600 3.4065 4.4499 2.5812 4.8877 3.1744 3.7784 3.3207 3.7417 4.9708 2.8450 2.0395 1.6495 2.3838 3.2696 3.7554 2.3040 5.3348 3.4620 4.3823 4.8850 3.5904 1.2549 4.5517 3.5641 2.4706 4.4677 4.4694 4.6229 2.4055 1.3530 3.4363 1.5515 2.4056 2.1455 2.0790 1.4769 2.2174 2.5666 1.3994 2.2292 1.5176 1.3340 7.9034 4.0058 2.9356 2.7602 2.3972 2.2405 1.5421 2.2187 1.2634 2.0696 2.2101 1.9005 1.5142 1.1025 1.3169 1.3430 1.6308 2.4574 1.7436 1.2763 1.9477 1.5356 1.3188 1.2581 1.1914 1.2744 1.3685 1.4349 2.3927 2.5349 1.7195 1.3887 1.2052 1.1014 1.1730 1.1795 1.0634 1.4376 1.0919 1.0848 2.0092 1.1029 6.7487 6.8726 7.1067 1.0714 1.0715 1.0708 1.0333 1.0610 1.0621 1.0694 1.0799 1.0868 1.0870 1.1037 1.1041 1.1045 1.1055 1.0863 1.0991 1.0899 1.0937 1.0989 1.0783
irintensity: 0.8615 1.0952 1.0723 1.1268 3.2809 0.3673 7.6820 2.6423 0.7414 1.6194 0.5467 2.1731 0.8466 5.1314 4.7144 4.6665 7.1978 1.7839 6.5472 11.4618 3.0145 16.9428 75.8546 8.7428 7.3599 3.9658 7.1054 3.0604 11.6320 0.3036 89.9314 3.0655 0.8762 8.2864 12.9474 6.9537 0.7019 8.5830 6.1898 4.7949 2.5488 6.7568 0.2336 40.0683 3.9732 11.2593 12.1369 5.6592 22.9302 0.2584 46.3718 0.2155 30.0372 7.2748 31.3463 6.2694 4.5580 4.7505 6.5398 13.6437 80.0142 77.0038 1.2060 81.4868 36.2864 18.4837 16.8611 16.0652 0.2184 0.5477 3.4894 4.4198 5.0785 29.8207 1.5688 48.5297 13.3006 26.9936 77.2068 18.7198 118.5557 19.6913 0.0977 110.9306 4.2376 29.0895 31.1415 166.2085 51.6605 78.1560 201.8900 69.8603 30.0514 18.1527 57.8701 65.1604 9.9972 33.8670 46.6195 8.0380 13.9147 72.9209 2.8693 19.5844 10.6941 24.3553 18.1737 17.0943
temp: 298.150 k
press: 1.00000 atm
elementType: 8 8 7 7 6 6 6 6 6 6 6 6 6 6 6 6 6 6 1 1 1 1 1 1 1 1 1 1 1 1 1 1 1 1 1 1 1 1
symmnumber: 1
zpe: 838313.6 jmol-1
zpe.correction: 0.319297 hartree
zpe.thermalcorrener: 0.336745 hartree
zpe.thermalcorrenthalpy: 0.337689 hartree
zpe.thermalcorrgfe: 0.271028 hartree
zpe.sumelectzpe: -804.045001 hartree
zpe.sumelectthermal: -804.027553 hartree
zpe.sumelectthermalent: -804.026609 hartree
zpe.sumelectthermalfe: -804.093270 hartree
dipole: 1.2208 2.1458 -3.0144
dipole: 3.8964
quadrupole: -79.1587 -102.2681 -110.3298
quadrupole: -7.4275 -1.1707 2.5401
quadrupole: 18.0935 -5.0159 -13.0776 -7.4275 -1.1707 2.5401
hfenergy: -804.364298 hartree
pointgroup: C01 [X(C14H20N2O2)]
dipole: 0.4838222 0.3364523 -1.4151465 debye
polarizability: 224.6149978|5.6697915|162.3646719|0.3559117|-19.835728|128.6079399 unknown
InChI: InChI=1S/C14H20N2O2/c1-18-13-7-3-2-6-12(13)14(17)15-8-11-16-9-4-5-10-16/h2-3,6-7,15H,4-5,8-11H2,1H3
charge 0 multiplicity 1
38 atoms
O  0.488155 -0.547131 1.419571
O  3.209956 -1.578078 0.543066
N  -3.828009 -0.152076 0.076715
N  -0.130266 -0.230414 -0.802164
C  -4.717125 0.68558 0.921437
C  -4.580609 -0.389629 -1.184448
C  -6.095324 0.015797 0.734511
C  -6.074081 -0.487335 -0.746855
C  -2.459749 0.361811 -0.089622
C  -1.499276 -0.735552 -0.610579
C  0.779499 -0.167396 0.246234
C  2.114542 0.437674 -0.132263
C  3.337141 -0.262325 0.092086
C  2.168482 1.754069 -0.646574
C  4.578227 0.366679 -0.177756
C  3.40324 2.38647 -0.922829
C  4.60453 1.687218 -0.681126
C  4.433618 -2.318201 0.859336
H  -4.751581 1.749883 0.569581
H  -4.368539 0.68382 1.969305
H  -4.227853 -1.308314 -1.686642
H  -4.442928 0.461855 -1.90136
H  -6.928322 0.711657 0.936159
H  -6.186422 -0.839677 1.425537
H  -6.449575 -1.522251 -0.815655
H  -6.709222 0.139566 -1.397262
H  -2.423476 1.244081 -0.783779
H  -2.083301 0.695422 0.894178
H  -1.472953 -1.552649 0.130749
H  -1.857435 -1.145218 -1.572214
H  0.182681 0.043961 -1.734267
H  1.23019 2.300018 -0.800431
H  5.519969 -0.162716 -0.006418
H  3.423654 3.410773 -1.308338
H  5.569662 2.16514 -0.883294
H  4.085529 -3.2937 1.228133
H  5.018397 -1.807556 1.648482
H  5.064571 -2.461054 -0.040103
