program: Gaussian 09
title: 000006716
version: EM64L-G09RevD.01
frameworkgroup: C1[X(C13H10O4)]
method: RPBEPBE
basis: SDD
operation: Freq
keyword: #pfreq=noraman
keyword: PBEPBE/SDD
title: #p freq=noraman PBEPBE/SDD
converged: YES YES NO NO
title: Mulliken charges:
elementType: O O O O C C C C C C C C C C C C C H H H H H H H H H H
charge: -0.258718 -0.234238 -0.262014 -0.272903 0.078982 0.120826 0.098868 0.234758 0.233555 -0.573028 0.179749 -0.349588 0.356718 -0.460316 -0.170375 -0.774966 -0.520404 0.286187 0.282912 0.260799 0.266630 0.249026 0.250472 0.242120 0.226975 0.298229 0.209743
chargesum: 0.00000
title: Mulliken charges with hydrogens summed into heavy atoms:
elementType: O O O O C C C C C C C C C C C C C
charge: -0.258718 -0.234238 -0.262014 -0.272903 0.078982 0.120826 0.098868 0.234758 0.233555 -0.286842 0.179749 -0.066677 0.356718 -0.199516 0.096255 -0.033348 0.214544
polarizability: 2.28337216e+02 -3.46938223e+00 1.83353644e+02 -9.48787229e-01 -4.05511909e+00 7.23927841e+01
1716.lowfreq: -5.5084 0.0006 0.0009 0.0009 3.3278 8.7121 52.8216 78.6808 104.7704
frequency: 52.7863 78.6804 104.7685 122.8762 133.4215 168.5387 182.2076 188.7748 224.9943 244.3679 274.8223 308.8537 329.3517 337.5994 382.0876 392.4881 478.4761 519.9341 537.8882 546.3575 568.9884 586.2736 613.1400 631.5351 670.4290 717.9480 740.5027 755.5698 780.1288 839.3570 843.3760 860.6952 875.6072 876.2227 883.6380 937.3607 971.6519 993.5172 1048.4414 1051.1183 1058.9056 1110.4885 1118.9664 1138.0215 1150.5869 1162.9758 1189.2104 1256.9911 1279.3399 1305.2096 1327.5774 1372.0413 1395.4376 1402.7974 1429.2158 1446.0709 1452.4509 1460.8979 1463.6365 1485.8720 1517.6132 1550.4384 1590.1591 1621.8572 1653.7130 2984.1559 2992.7276 3073.0454 3098.1822 3119.6585 3132.1684 3184.9515 3202.2193 3241.0581 3272.6641
redmass: 4.2617 4.5663 2.4295 1.5811 1.2376 3.0513 3.8048 5.2397 4.7231 3.2719 6.2300 3.8212 5.0253 6.3053 6.1142 5.8480 7.5457 7.4390 4.4868 5.4739 4.5756 5.4098 4.1878 6.4105 5.8490 3.2720 5.3779 1.5706 3.6783 7.0014 1.5307 1.6038 4.3425 1.4612 6.7425 3.3898 3.5616 2.2125 2.4984 1.5458 3.9516 1.2346 1.8257 2.0755 1.3581 3.5424 1.9013 2.0537 6.1418 2.4836 4.0637 4.4766 3.5778 1.3099 1.6626 1.2795 1.0438 2.1004 1.2716 1.0833 5.5039 7.9513 9.5272 9.5219 7.3784 1.0315 1.0376 1.0975 1.1004 1.0991 1.1056 1.0930 1.0943 1.0912 1.1092
irintensity: 3.3947 1.9468 7.2528 0.3335 0.2165 0.5028 1.1977 1.6927 7.4398 1.8178 0.3509 7.3562 3.1692 4.3683 2.9409 9.5185 5.4703 4.3698 3.6668 14.0318 3.4636 3.2284 3.0636 3.8508 2.5792 10.9109 1.3786 51.7220 9.0036 17.9780 38.3254 30.3649 12.8153 12.4819 9.3477 11.1158 13.4111 6.4677 59.5305 8.5951 102.6826 13.2280 62.6246 15.3624 3.6246 17.5875 32.6672 4.4551 25.0711 45.0152 216.1189 78.6798 31.9424 63.2340 75.2276 24.7804 16.4976 78.0756 20.1865 71.5698 24.8629 143.5937 71.7056 100.1492 227.6271 70.2487 11.1033 9.4017 33.6489 11.0076 5.1421 2.6618 1.3719 3.4029 0.0774
temp: 298.150 k
press: 1.00000 atm
elementType: 8 8 8 8 6 6 6 6 6 6 6 6 6 6 6 6 6 1 1 1 1 1 1 1 1 1 1
symmnumber: 1
zpe: 520950.2 jmol-1
zpe.correction: 0.198419 hartree
zpe.thermalcorrener: 0.212833 hartree
zpe.thermalcorrenthalpy: 0.213777 hartree
zpe.thermalcorrgfe: 0.157354 hartree
zpe.sumelectzpe: -801.045472 hartree
zpe.sumelectthermal: -801.031059 hartree
zpe.sumelectthermalent: -801.030115 hartree
zpe.sumelectthermalfe: -801.086538 hartree
dipole: -0.6253 -1.7664 2.0641
dipole: 2.7878
quadrupole: -76.2629 -99.4977 -100.2874
quadrupole: 9.2350 -1.3285 6.3797
quadrupole: 15.7531 -7.4817 -8.2714 9.2350 -1.3285 6.3797
hfenergy: -801.2438917 hartree
pointgroup: C01 [X(C13H10O4)]
dipole: 0.2292731 0.7296819 0.7861046 debye
polarizability: 228.1175886|-3.6727093|183.5368546|5.3404609|-1.1182234|72.4292012 unknown
InChI: InChI=1S/C13H10O4/c1-7-5-9(14)12-11(17-7)6-10-8(3-4-16-10)13(12)15-2/h3-6H,1-2H3
charge 0 multiplicity 1
27 atoms
O  1.885353 1.58874 0.152568
O  -2.92455 2.12537 -0.168848
O  -1.351064 -2.24729 0.012879
O  1.617552 -2.514926 -0.478045
C  0.422281 -0.430026 -0.001195
C  -1.995235 0.008094 -0.111093
C  -0.930089 -0.926209 -0.022606
C  0.600533 1.003788 0.051757
C  -1.721579 1.40278 -0.106278
C  -0.439762 1.947851 0.003337
C  1.641466 -1.272334 -0.174038
C  -3.439859 -0.132089 -0.175171
C  3.026088 0.781009 0.134868
C  2.924812 -0.575086 -0.024166
C  -3.957686 1.142965 -0.215661
C  4.277355 1.5950 0.280486
C  -0.72275 -3.238006 0.916757
H  -0.234322 3.017946 0.045921
H  -3.99639 -1.065009 -0.199715
H  3.827886 -1.186619 -0.082393
H  -4.964316 1.546584 -0.278331
H  4.271416 2.150217 1.236168
H  4.355072 2.340334 -0.531753
H  5.165288 0.94491 0.252964
H  -1.503364 -3.999204 1.069878
H  0.175939 -3.656176 0.440448
H  -0.458474 -2.762515 1.879864
