program: Gaussian 09
title: 000052013
version: EM64L-G09RevD.01
frameworkgroup: C1[X(C9H13N3O2)]
method: RPBEPBE
basis: SDD
operation: Freq
keyword: #p
keyword: freq=noraman
keyword: PBEPBE/SDD
title: #p freq=noraman PBEPBE/SDD
converged: YES YES NO NO
title: Mulliken charges:
elementType: O O N N N C C C C C C C C C H H H H H H H H H H H H H
charge: -0.309981 -0.293780 -0.106035 -0.099671 -0.075115 -0.370307 -0.552690 -0.540949 -0.554201 -0.267444 0.188681 0.029035 -0.222399 -0.218627 0.279004 0.279247 0.271115 0.245216 0.280558 0.269774 0.250252 0.270209 0.271310 0.281232 0.245289 0.225692 0.224586
chargesum: 0.00000
title: Mulliken charges with hydrogens summed into heavy atoms:
elementType: O O N N N C C C C C C C C C
charge: -0.309981 -0.293780 -0.106035 -0.099671 -0.075115 0.187944 0.244200 0.249286 0.243630 0.182834 0.188681 0.029035 -0.222399 -0.218627
polarizability: 1.77197021e+02 -3.01416748e+00 1.31634941e+02 4.61792236e-01 -5.53144177e-02 7.86819040e+01
1716.lowfreq: -25.9603 -11.8337 -2.7958 -0.0007 0.0005 0.0007 6.3513 8.9659 52.8021
frequency: -21.6972 -10.5247 52.7948 55.4216 82.3081 107.5144 124.1535 141.5409 192.6146 201.2939 214.1275 250.0978 254.7297 259.8492 343.1326 353.0124 404.0990 434.1624 440.1877 461.8358 471.8212 515.4079 550.8821 551.5645 599.0617 687.7723 689.3424 760.3274 798.6318 860.8575 890.7567 931.0275 946.4381 1021.5603 1047.3045 1054.7943 1068.7503 1120.2126 1136.4609 1180.8572 1217.8710 1233.5273 1233.7314 1249.5032 1275.3377 1293.0090 1317.5582 1370.1039 1423.5528 1424.2508 1444.1876 1452.3365 1462.0244 1465.2659 1469.1288 1484.4141 1484.9979 1486.9515 1500.5335 1657.4280 2139.5847 2157.3882 2966.4136 3016.0604 3022.9159 3026.1245 3029.2361 3036.8329 3114.3942 3137.9916 3138.2737 3143.9269 3145.5381 3153.7913 3157.8979
redmass: 3.7186 3.3600 6.6157 1.8130 7.3304 3.9735 8.9771 6.4308 1.3004 7.6685 4.3097 2.8162 1.3147 1.0804 2.2532 3.3548 4.9872 2.2815 3.6281 3.9611 12.3064 4.4300 6.8002 12.1279 12.4207 7.3456 11.9499 5.1183 1.1538 3.6388 9.0301 2.6509 2.7272 8.6860 1.1981 1.2723 2.0489 1.6975 1.4185 1.2017 1.7196 1.8346 3.5551 1.9037 4.9557 1.4296 1.5486 1.4101 1.1445 1.1449 1.0913 1.0451 1.1174 1.0403 1.0677 1.0580 1.0531 1.0693 1.0556 12.4597 12.5986 12.6203 1.0550 1.1042 1.0323 1.0343 1.0343 1.0574 1.1087 1.1053 1.1054 1.1050 1.1046 1.1050 1.1044
irintensity: 0.0262 0.0130 1.1912 0.0116 1.7664 1.3706 11.6374 0.5057 0.1019 11.0706 3.8751 5.5958 3.7608 0.1644 0.0309 3.2820 1.9115 0.0034 8.7578 5.2250 0.0122 4.4125 4.1258 0.0285 1.0770 27.9888 14.5225 38.1503 2.7424 227.4923 173.4250 13.7352 27.1906 202.7076 0.0273 0.0853 0.0986 1.7558 0.1610 0.0225 0.0180 5.3732 5.7613 1.8417 96.2118 3.1675 22.9843 4.8742 19.6149 18.4646 1.0346 0.9201 7.5241 0.1061 7.2421 55.1095 37.3573 21.3407 77.8912 536.7940 183.3380 134.8651 80.1190 27.3527 4.1125 10.1662 10.8603 7.4491 5.5015 0.5329 0.5025 20.9272 3.7238 1.5961 4.9524
temp: 298.150 k
press: 1.00000 atm
elementType: 8 8 7 7 7 6 6 6 6 6 6 6 6 6 1 1 1 1 1 1 1 1 1 1 1 1 1
symmnumber: 1
zpe: 559785.3 jmol-1
zpe.correction: 0.213211 hartree
zpe.thermalcorrener: 0.227444 hartree
zpe.thermalcorrenthalpy: 0.228388 hartree
zpe.thermalcorrgfe: 0.171839 hartree
zpe.sumelectzpe: -664.271268 hartree
zpe.sumelectthermal: -664.257035 hartree
zpe.sumelectthermalent: -664.256090 hartree
zpe.sumelectthermalfe: -664.312639 hartree
dipole: -27.4628 -0.6518 0.0130
dipole: 27.4705
quadrupole: -88.9297 -102.3711 -77.0652
quadrupole: 0.7950 -0.2562 0.0721
quadrupole: 0.5256 -12.9158 12.3902 0.7950 -0.2562 0.0721
hfenergy: -664.4844785 hartree
pointgroup: C01 [X(C9H13N3O2)]
dipole: -10.7861134 0.4510681 0.5133489 debye
polarizability: 177.1922106|2.6718765|127.121229|-3.1637118|14.5343341|83.2004265 unknown
InChI: InChI=1S/C9H13N3O2/c1-12(2,3)4-5-14-9(13)8(6-10)7-11/h4-5H2,1-3H3
charge 0 multiplicity 1
27 atoms
O  0.192342 -0.191442 -0.053945
O  1.314201 1.807349 0.499599
N  -3.545044 0.017071 0.115065
N  2.29527 -2.705453 -0.904981
N  4.984461 0.830292 0.042278
C  -2.079347 -0.467389 -0.075464
C  -3.845736 1.183146 -0.822281
C  -4.471031 -1.148104 -0.22044
C  -3.780558 0.444826 1.560705
C  -1.00328 0.580402 0.233769
C  1.439709 0.603589 0.132087
C  2.57714 -0.200763 -0.160567
C  2.430049 -1.559814 -0.564623
C  3.881536 0.363373 -0.048666
H  -1.942414 -1.342978 0.581656
H  -1.982922 -0.795458 -1.124459
H  -3.609839 0.879033 -1.853403
H  -4.912133 1.445242 -0.737946
H  -3.223438 2.044738 -0.543634
H  -4.252539 -1.985017 0.460008
H  -5.518433 -0.829039 -0.102245
H  -4.287144 -1.462482 -1.258943
H  -3.495217 -0.383768 2.22657
H  -3.162418 1.324882 1.785353
H  -4.846337 0.688924 1.693424
H  -1.060491 1.477735 -0.414343
H  -1.010586 0.920805 1.288724
