program: Gaussian 09
title: 000052049
version: EM64L-G09RevD.01
frameworkgroup: C1[X(C15H11Cl2NO)]
method: RPBEPBE
basis: SDD
operation: Freq
keyword: #p
keyword: freq=noraman
keyword: PBEPBE/SDD
title: #p freq=noraman PBEPBE/SDD
converged: NO YES NO NO
title: Mulliken charges:
elementType: Cl Cl O N C C C C C C C C C C C C C C C H H H H H H H H H H H
charge: -0.054671 -0.053619 -0.244159 -0.447254 -0.045613 -0.697411 0.327695 0.242387 0.272993 0.376900 -0.474446 -0.319362 -0.409211 -0.310168 -0.111697 -0.265864 -0.104599 0.221221 -0.804115 0.253334 0.253327 0.269816 0.204406 0.270587 0.333125 0.256390 0.308382 0.240010 0.273486 0.238132
chargesum: 0.00000
title: Mulliken charges with hydrogens summed into heavy atoms:
elementType: Cl Cl O N C C C C C C C C C C C C C C C
charge: -0.054671 -0.053619 -0.244159 -0.138873 -0.045613 -0.190750 0.327695 0.242387 0.272993 0.376900 -0.204630 -0.114956 -0.138624 0.022957 -0.111697 -0.009473 -0.104599 0.221221 -0.052488
polarizability: 3.25408888e+02 9.58998663e+00 2.22556972e+02 -1.21735164e-02 4.42765932e-02 7.92480092e+01
1716.lowfreq: -78.7327 -6.9143 -4.8227 -1.7013 -0.0021 -0.0005 0.0014 19.0832 46.1675
frequency: -78.7283 18.7275 46.1644 53.5389 89.7475 97.8556 130.2665 147.8417 212.7428 217.6521 232.8272 242.4585 249.4192 271.9242 324.5418 375.1870 375.9710 396.9618 418.1286 496.6177 499.8768 538.3217 552.1195 552.4619 570.4690 573.3104 592.6408 629.2036 670.7234 677.0971 703.8565 740.3035 752.2286 800.5341 852.0733 853.0234 856.5149 880.1217 902.0558 923.9707 924.2997 958.4286 971.0540 988.6285 1031.6776 1047.3280 1075.2189 1091.1922 1132.2573 1135.9201 1183.3882 1196.3546 1221.9010 1223.9281 1254.3913 1285.0167 1297.2244 1366.9255 1376.8524 1380.8578 1402.1828 1419.7339 1429.9179 1445.1280 1450.7483 1467.9062 1471.1671 1505.0142 1578.7549 1591.7579 1604.5464 1608.0329 1640.7623 2987.3133 2987.8341 3033.4624 3072.2883 3124.9877 3137.6994 3159.0891 3167.0935 3172.7918 3194.9853 3574.1158
redmass: 1.0543 3.9197 8.9555 6.4460 5.8415 4.5173 14.5315 5.5507 3.9495 8.3660 9.4449 2.5563 4.4487 10.9359 4.5348 4.7457 6.1557 8.7071 2.9838 4.4442 3.1753 5.2153 3.7374 4.9394 3.3232 5.1119 2.5262 1.6580 6.8260 6.7357 3.5642 5.4512 2.4321 2.0652 1.3843 5.8723 5.4389 1.3653 4.8950 1.3850 1.3978 2.1569 2.0673 7.2208 1.6645 3.5769 2.0819 1.6918 2.3703 1.1429 1.4146 1.7126 1.6963 2.8392 2.7428 1.5492 2.9256 5.9480 1.2434 5.1073 2.7727 1.8914 1.7359 2.3718 1.5078 1.0468 3.1884 2.0415 7.4115 8.0032 7.0666 7.3075 4.9666 1.0386 1.0610 1.0993 1.0984 1.0886 1.0978 1.0931 1.0936 1.0949 1.0932 1.0757
irintensity: 0.0050 7.8531 0.3416 3.0301 3.4836 0.7389 0.1466 0.0550 1.9517 0.8153 1.8419 4.4447 4.6483 3.3982 0.0737 3.0412 11.0648 19.8252 3.1585 10.5076 4.0396 1.7808 1.5653 3.1041 0.0094 5.0257 1.1889 58.8391 3.7163 10.2240 0.1091 0.4142 25.7364 41.7632 25.9619 78.2412 13.2621 1.8732 1.3875 33.8853 0.0457 14.2301 33.4442 13.7472 8.0839 6.0815 15.7984 24.9240 6.6729 0.0002 20.8049 1.8159 13.9788 92.7685 28.1257 9.9602 61.7238 41.6415 54.3280 3.6096 329.0574 19.4300 18.9757 51.0190 100.6744 21.3585 17.9982 240.8352 23.3450 139.6709 103.3293 52.1248 122.9617 6.1070 8.1936 4.4821 13.5055 38.0692 6.8098 1.6088 0.9426 3.9552 21.2565 44.0351
temp: 298.150 k
press: 1.00000 atm
elementType: 17 17 8 7 6 6 6 6 6 6 6 6 6 6 6 6 6 6 6 1 1 1 1 1 1 1 1 1 1 1
symmnumber: 1
zpe: 573547.4 jmol-1
zpe.correction: 0.218453 hartree
zpe.thermalcorrener: 0.234556 hartree
zpe.thermalcorrenthalpy: 0.235500 hartree
zpe.thermalcorrgfe: 0.172825 hartree
zpe.sumelectzpe: -1627.011106 hartree
zpe.sumelectthermal: -1626.995003 hartree
zpe.sumelectthermalent: -1626.994059 hartree
zpe.sumelectthermalfe: -1627.056733 hartree
dipole: 3.6386 0.8449 0.0054
dipole: 3.7354
quadrupole: -157.4493 -102.8270 -127.2652
quadrupole: 1.1111 -0.0147 0.0254
quadrupole: -28.2688 26.3535 1.9153 1.1111 -0.0147 0.0254
hfenergy: -1627.2295588 hartree
pointgroup: C01 [X(C15H11Cl2N1O1)]
dipole: -1.3679223 0.5371782 -0.0021071 debye
polarizability: 320.4698886|-23.9908254|227.4959714|-0.0184867|-0.0420339|79.2480092 unknown
InChI: InChI=1S/C15H11Cl2NO/c1-8(19)18-14-7-12(17)6-10-4-9-5-11(16)2-3-13(9)15(10)14/h2-3,5-7,18H,4H2,1H3
charge 0 multiplicity 1
30 atoms
Cl 4.068655 -2.972589 -0.000976
Cl -5.787418 0.705951 0.000676
O  3.861693 2.043624 0.002104
N  1.544271 1.633383 0.000237
C  0.205029 -0.427938 0.000004
C  -1.298236 -2.326813 0.000698
C  0.14632 -1.854952 0.000185
C  -1.184139 0.09421 0.000048
C  -2.079935 -1.025576 0.000579
C  1.480411 0.215728 -0.000165
C  1.301173 -2.652584 -0.000066
C  -1.735421 1.401454 -0.00051
C  -3.473515 -0.860691 0.000785
C  2.659247 -0.579792 -0.000526
C  2.539533 -1.979411 -0.000506
C  -3.138041 1.582827 -0.000304
C  -3.981564 0.455358 0.000391
C  2.67198 2.468277 -0.000771
C  2.323962 3.956574 0.000931
H  -1.528626 -2.946231 0.889134
H  -1.529159 -2.946679 -0.887286
H  1.250972 -3.744502 0.000057
H  -1.127384 2.312558 -0.001358
H  -4.150708 -1.720012 0.0012
H  3.634581 -0.091555 -0.000769
H  -3.566797 2.588866 -0.000741
H  0.645587 2.113851 0.00145
H  1.75805 4.236992 -0.906949
H  3.258797 4.534049 0.024584
H  1.716881 4.228425 0.884465
