program: Gaussian 09
title: 000051991
version: EM64L-G09RevD.01
frameworkgroup: C1[X(C14H11NO2)]
method: RPBEPBE
basis: SDD
operation: Freq
keyword: #p
keyword: freq=noraman
keyword: PBEPBE/SDD
title: #p freq=noraman PBEPBE/SDD
converged: NO YES NO NO
title: Mulliken charges:
elementType: O O N C C C C C C C C C C C C C C H H H H H H H H H H H
charge: -0.313251 -0.257383 -0.468853 0.068382 0.237192 0.264201 0.166681 0.046071 0.242809 -0.396527 -0.392483 -0.355966 -0.355613 -0.248111 -0.209629 -0.264505 -0.527527 0.339506 0.278647 0.233420 0.279087 0.242121 0.229159 0.229187 0.232821 0.228271 0.243918 0.228374
chargesum: 0.00000
title: Mulliken charges with hydrogens summed into heavy atoms:
elementType: O O N C C C C C C C C C C C C C C
charge: -0.313251 -0.257383 -0.129347 0.068382 0.237192 0.264201 0.166681 0.046071 0.242809 -0.117880 -0.159062 -0.076880 -0.113492 -0.018951 0.019558 -0.031683 0.173037
polarizability: 2.60583266e+02 1.29369179e+01 1.94685469e+02 -1.12811985e-01 9.18205973e-02 6.78430030e+01
1716.lowfreq: -4.5272 -0.0010 -0.0009 -0.0005 5.7355 10.6904 66.5408 69.6460 116.8856
frequency: 66.5400 69.6455 116.8853 141.8855 149.8198 196.1278 244.3160 265.3051 269.3083 308.3190 320.4960 331.3404 376.7740 427.6959 480.4842 509.1260 518.3936 532.6180 559.3557 567.6324 618.6706 644.3100 663.0994 676.7896 690.4017 731.0855 768.7377 776.3405 799.3391 821.0227 865.1066 874.6825 881.8312 897.4114 939.4180 968.3395 981.9284 1000.0457 1028.1172 1051.1645 1067.3592 1104.6194 1116.2240 1153.6984 1169.9369 1178.3903 1184.4625 1230.5121 1262.2611 1268.8651 1279.5388 1307.5304 1392.9945 1406.4913 1426.3257 1438.3716 1453.0644 1466.0398 1466.2850 1476.0359 1480.6546 1520.9132 1543.4316 1578.9691 1600.3435 1626.2624 1630.2390 2967.1144 3057.7147 3121.2462 3129.0552 3140.0569 3142.3557 3152.5166 3161.5439 3169.0360 3173.6706 3536.6635
redmass: 3.7353 5.3347 4.1902 4.2337 6.1856 1.7116 1.9915 4.2774 3.8996 4.5626 4.2021 7.8722 7.3444 3.5388 6.9323 4.2085 8.6085 3.7573 6.0470 3.6339 6.0333 5.5178 1.2161 6.6917 3.3643 3.1102 1.7116 1.4305 6.3732 2.8459 5.7607 1.5840 5.4862 1.4429 6.9063 1.3628 1.3195 1.3340 2.2335 4.6602 1.8717 2.1102 1.2575 1.3225 1.1088 1.3319 1.7047 3.0169 2.1784 2.0027 2.2517 2.4915 2.8858 5.9646 2.4395 1.5446 2.5721 1.7989 1.0643 1.5756 1.9992 4.5690 9.7480 4.9716 8.3736 5.7804 7.2154 1.0324 1.1045 1.0874 1.1002 1.0890 1.0866 1.0935 1.0916 1.1001 1.0986 1.0769
irintensity: 0.4113 4.9061 3.4467 3.1052 1.7033 0.0476 0.1430 1.4402 0.9785 7.8211 0.8068 3.5108 1.6235 0.9509 7.6433 1.4926 7.6529 10.9825 3.8028 4.5600 5.2734 5.3030 55.3394 1.7247 8.0350 28.4890 157.6243 5.0216 5.0037 18.9227 0.3504 0.7713 1.2669 0.0037 49.8832 2.5754 2.7820 0.7658 2.3952 71.4770 23.8924 14.5949 0.0945 1.8592 9.0410 0.1279 48.4050 130.2297 5.9673 12.0654 24.5756 30.0597 11.7358 39.9633 18.7657 10.9993 33.4816 53.2768 16.1128 38.1350 16.5899 226.6380 255.7926 46.2456 33.9219 189.7545 6.1394 69.6916 41.5748 5.0683 19.3619 12.0796 7.1760 8.3703 4.4552 33.0382 19.0634 78.4123
temp: 298.150 k
press: 1.00000 atm
elementType: 8 8 7 6 6 6 6 6 6 6 6 6 6 6 6 6 6 1 1 1 1 1 1 1 1 1 1 1
symmnumber: 1
zpe: 566495.8 jmol-1
zpe.correction: 0.215767 hartree
zpe.thermalcorrener: 0.229052 hartree
zpe.thermalcorrenthalpy: 0.229996 hartree
zpe.thermalcorrgfe: 0.176153 hartree
zpe.sumelectzpe: -744.139055 hartree
zpe.sumelectthermal: -744.125769 hartree
zpe.sumelectthermalent: -744.124825 hartree
zpe.sumelectthermalfe: -744.178668 hartree
dipole: 3.8581 -5.6228 0.0102
dipole: 6.8192
quadrupole: -72.9833 -96.7564 -103.5349
quadrupole: 2.8829 0.0279 -0.0227
quadrupole: 18.1082 -5.6649 -12.4434 2.8829 0.0279 -0.0227
hfenergy: -744.3548215 hartree
pointgroup: C01 [X(C14H11N1O2)]
dipole: -1.2226839 -2.3798969 -0.1974996 debye
polarizability: 261.7783303|-4.8525635|192.2898368|13.6989352|5.0401806|69.0435709 unknown
InChI: InChI=1S/C14H11NO2/c1-17-12-8-4-6-10-13(12)15-11-7-3-2-5-9(11)14(10)16/h2-8,15H,1H3
charge 0 multiplicity 1
28 atoms
O  -2.279008 -2.148434 -0.34551
O  1.061762 2.8865 0.115817
N  0.194567 -1.182094 -0.117982
C  -0.847893 -0.261725 -0.155031
C  -0.599379 1.137638 -0.076916
C  1.529529 -0.794303 -0.006712
C  1.85443 0.59803 0.074186
C  0.79353 1.639115 0.044204
C  -2.189469 -0.743781 -0.275132
C  -1.699078 2.039786 -0.117812
C  2.562975 -1.7730 0.025526
C  3.219469 0.976775 0.184865
C  -3.263129 0.156954 -0.313579
C  -3.009241 1.557906 -0.233369
C  3.902359 -1.368497 0.135678
C  4.238664 0.012803 0.215796
C  -3.615433 -2.73403 -0.476479
H  -0.057802 -2.171149 -0.181594
H  -1.477104 3.109315 -0.055297
H  2.306974 -2.837604 -0.03651
H  3.435781 2.04868 0.244762
H  -4.292774 -0.202247 -0.402908
H  -3.853285 2.254406 -0.264069
H  4.694368 -2.125352 0.159752
H  5.286922 0.316444 0.301374
H  -4.245634 -2.481075 0.397519
H  -3.455075 -3.821126 -0.519186
H  -4.108725 -2.390336 -1.405692
