program: Gaussian 09
title: 000052086
version: EM64L-G09RevD.01
frameworkgroup: C1[X(C17H26N2O2)]
method: RPBEPBE
basis: SDD
operation: Freq
keyword: #p
keyword: freq=noraman
keyword: PBEPBE/SDD
title: #p freq=noraman PBEPBE/SDD
converged: YES YES NO NO
title: Mulliken charges:
elementType: O O N N C C C C C C C C C C C C C C C C C H H H H H H H H H H H H H H H H H H H H H H H H H H
charge: -0.265659 -0.275466 -0.085020 -0.380807 -0.366505 -0.359214 -0.447807 -0.443486 -0.342449 -0.396809 0.132892 0.304311 -0.381982 -0.292232 -0.507202 -0.342495 0.348390 -0.396115 -0.380225 -0.193476 -0.685426 0.196599 0.219305 0.224429 0.177924 0.223306 0.216001 0.205144 0.227240 0.199450 0.214681 0.261233 0.226331 0.300046 0.211425 0.212851 0.197482 0.205182 0.194518 0.192350 0.247963 0.272988 0.254307 0.231442 0.212584 0.218538 0.213459
chargesum: 0.00000
title: Mulliken charges with hydrogens summed into heavy atoms:
elementType: O O N N C C C C C C C C C C C C C C C C C
charge: -0.265659 -0.275466 -0.085020 -0.080761 0.049399 0.043140 -0.008500 -0.011102 0.071682 0.090755 0.132892 0.304311 0.042295 0.110432 -0.259238 0.044373 0.348390 -0.123126 -0.125918 0.037966 -0.040845
polarizability: 2.68362965e+02 -2.73871052e-03 2.17667359e+02 -1.30857255e+01 4.20015324e+00 1.41726875e+02
1716.lowfreq: -2.9989 -0.0006 0.0000 0.0012 3.3221 6.5922 14.1161 22.1335 30.2623
frequency: 14.0415 22.1031 30.2317 35.0651 45.0964 50.0478 55.3083 62.9598 83.9780 101.9961 114.2663 131.1603 143.3350 167.8356 204.3349 225.3139 234.5642 239.1971 263.9976 276.1516 306.5117 334.8850 358.3953 382.6024 415.1391 428.9252 469.9947 491.7396 547.2910 560.4417 583.1483 614.1306 641.5367 659.7675 688.0574 731.5631 743.2115 744.3441 768.8811 810.6458 816.1453 818.0444 840.3544 864.4413 866.5264 883.8468 901.4450 912.0671 921.0246 944.9599 958.2496 966.1367 970.9851 986.3653 988.1269 1016.0304 1042.6503 1047.1141 1064.5823 1081.7627 1086.8544 1089.3776 1096.8062 1124.2450 1132.7162 1145.3515 1146.3786 1150.7427 1168.9389 1186.5966 1198.6495 1209.9249 1214.2066 1215.0204 1234.9455 1242.6293 1271.3367 1279.6380 1281.9125 1282.5904 1289.7146 1290.4981 1300.3776 1301.9434 1312.4502 1340.1392 1350.1757 1355.1068 1376.7477 1385.9962 1390.6885 1394.7254 1419.9652 1448.1761 1463.9844 1465.1601 1469.0179 1470.6828 1474.5827 1477.9989 1479.9457 1480.8913 1484.0223 1491.3428 1496.8222 1499.3247 1581.6317 1599.7033 1610.2960 2841.5205 2862.0509 2869.5329 2939.7646 2967.0657 2977.0347 2996.2357 2996.8717 3006.3876 3010.8927 3011.1166 3014.0965 3021.2867 3033.2365 3040.4960 3060.6172 3067.8872 3075.5025 3077.7079 3089.6767 3091.8260 3140.1661 3146.2615 3164.7118 3175.2433 3554.3621
redmass: 4.0835 2.6287 4.1212 3.6594 2.1921 3.0062 2.5895 2.6348 3.0342 3.7010 3.1872 3.1724 2.2273 3.2450 4.0273 2.3810 1.2951 3.0497 3.8385 3.8955 4.1582 2.3598 4.8722 3.3324 4.1267 3.4347 3.8920 4.0969 1.3491 3.4650 5.6217 2.4446 4.5607 4.8770 2.5059 3.4661 2.0356 1.1060 1.3982 1.2944 1.9036 1.2779 2.0333 2.0784 1.6959 3.2166 2.6017 2.0148 1.4256 1.1543 2.0333 1.6170 5.5255 3.5105 1.5957 3.4594 3.3731 3.5157 2.3509 1.7900 1.9443 2.1951 1.5600 2.4550 2.1875 2.3236 1.4518 2.2240 1.1124 1.3256 1.3660 1.7007 1.3997 2.2488 1.5087 1.2333 2.2206 1.3626 1.2120 1.2151 1.0637 1.2923 1.3061 1.2421 1.3128 1.4368 1.4514 1.3828 1.6714 1.3747 1.3908 3.4036 3.0601 1.1529 1.3595 1.2383 1.1080 1.1298 1.1110 1.0427 1.0884 1.0873 1.1043 1.1450 1.9530 1.1133 6.7487 6.4444 6.7067 1.0711 1.0716 1.0692 1.0548 1.0590 1.0360 1.0656 1.0989 1.0892 1.0599 1.1010 1.0610 1.0674 1.0862 1.0872 1.1041 1.1040 1.1014 1.0995 1.1031 1.1055 1.0873 1.0900 1.0924 1.0986 1.0773
irintensity: 0.4008 0.0909 0.2378 1.7974 0.4533 0.5510 1.3471 4.6117 0.1510 1.2758 2.3778 3.5469 2.2743 1.3246 0.9175 4.7500 0.0841 0.6629 1.4844 0.2124 5.5732 9.3567 2.2492 2.4470 6.2741 8.7251 9.6429 8.9802 115.6602 2.0975 3.7994 1.0204 2.7649 0.2357 8.6499 43.0523 10.1191 4.2333 1.5791 21.3641 11.1779 11.2946 10.3045 9.3189 27.0952 3.6685 7.3351 13.0758 0.9028 0.3647 1.3894 1.3065 42.3898 13.3796 5.5009 26.2159 21.6986 10.4293 5.5330 17.6704 5.6959 4.7431 0.2668 12.3891 25.1917 20.1063 1.6440 69.4533 6.7033 1.9810 13.2515 53.3615 6.0781 107.8075 12.5025 3.1228 210.9575 26.3491 0.7485 6.8663 0.0918 6.4928 6.1938 2.4218 2.0274 9.3773 0.1256 17.3768 11.6570 5.8338 14.0677 27.7381 34.2526 24.5223 79.0977 36.0900 5.9462 10.1823 17.4187 12.6741 11.8274 2.3069 36.9955 9.8345 152.3831 19.9941 229.2730 23.2176 17.8560 76.2759 31.8673 147.8233 28.4750 34.0237 36.0921 35.2145 29.7972 29.5647 16.0043 5.6200 38.6801 68.7414 72.4478 16.6477 16.9570 6.8982 98.9626 46.5801 15.0357 70.9955 12.5794 9.1553 2.9939 11.1155 9.5269
temp: 298.150 k
press: 1.00000 atm
elementType: 8 8 7 7 6 6 6 6 6 6 6 6 6 6 6 6 6 6 6 6 6 1 1 1 1 1 1 1 1 1 1 1 1 1 1 1 1 1 1 1 1 1 1 1 1 1 1
symmnumber: 1
zpe: 1059685.5 jmol-1
zpe.correction: 0.403613 hartree
zpe.thermalcorrener: 0.426040 hartree
zpe.thermalcorrenthalpy: 0.426985 hartree
zpe.thermalcorrgfe: 0.347095 hartree
zpe.sumelectzpe: -921.728378 hartree
zpe.sumelectthermal: -921.705950 hartree
zpe.sumelectthermalent: -921.705006 hartree
zpe.sumelectthermalfe: -921.784896 hartree
dipole: -1.2466 -3.7277 1.6656
dipole: 4.2689
quadrupole: -115.6529 -127.1642 -130.1690
quadrupole: 2.2897 4.2624 5.0112
quadrupole: 8.6758 -2.8355 -5.8403 2.2897 4.2624 5.0112
hfenergy: -922.1319904 hartree
pointgroup: C01 [X(C17H26N2O2)]
dipole: 0.3954002 1.5308677 0.5665015 debye
polarizability: 268.0010075|3.9689692|217.1763451|13.8935652|-7.9163445|142.5798464 unknown
InChI: InChI=1S/C17H26N2O2/c1-2-3-13-21-16-8-6-7-15(14-16)17(20)18-9-12-19-10-4-5-11-19/h6-8,14,18H,2-5,9-13H2,1H3
charge 0 multiplicity 1
47 atoms
O  4.223431 -0.152931 0.418247
O  -1.428501 -2.157999 -0.876673
N  -4.694977 0.979313 0.19035
N  -1.03499 0.045147 -0.240107
C  -5.461902 0.148504 -0.782902
C  -5.620963 1.197338 1.332385
C  -6.93092 0.655787 -0.664889
C  -6.956855 1.528956 0.633743
C  -3.376706 0.440016 0.569132
C  -2.380851 0.503885 -0.614611
C  -0.641011 -1.277222 -0.404745
C  0.769872 -1.607656 0.017525
C  5.381613 1.941313 0.07928
C  4.0255 1.240641 -0.023373
C  1.811305 -0.64023 0.007981
C  5.307976 3.423088 -0.358209
C  3.117353 -1.015366 0.40668
C  1.042008 -2.939504 0.407016
C  3.384002 -2.345416 0.820082
C  2.347435 -3.29833 0.812649
C  6.676097 4.131599 -0.261918
H  -5.401116 -0.936829 -0.51734
H  -5.055058 0.263884 -1.80273
H  -5.253377 2.012493 1.981691
H  -5.73099 0.276535 1.962146
H  -7.224391 1.252773 -1.544878
H  -7.629316 -0.196423 -0.595053
H  -7.827647 1.310663 1.276131
H  -6.982901 2.600766 0.371924
H  -2.983116 1.050211 1.406056
H  -3.435136 -0.620122 0.924579
H  -2.726173 -0.152263 -1.430954
H  -2.33122 1.542111 -0.990722
H  -0.430003 0.68109 0.280915
H  5.742179 1.873434 1.123526
H  6.113321 1.398479 -0.54913
H  3.272653 1.73446 0.627852
H  3.651579 1.25076 -1.069253
H  4.934266 3.483863 -1.400778
H  4.569338 3.959932 0.27171
H  1.615967 0.372235 -0.359583
H  0.22812 -3.669784 0.376016
H  4.402836 -2.604909 1.123552
H  2.559927 -4.327096 1.122724
H  7.060752 4.111426 0.774963
H  6.605177 5.188594 -0.576484
H  7.425015 3.635584 -0.907121
