program: Gaussian 09
title: 000006715
version: EM64L-G09RevD.01
frameworkgroup: C1[X(C12H15NO4)]
method: RPBEPBE
basis: SDD
operation: Freq
keyword: #p
keyword: freq=noraman
keyword: PBEPBE/SDD
title: #p freq=noraman PBEPBE/SDD
converged: YES YES NO NO
title: Mulliken charges:
elementType: O O O O N C C C C C C C C C C C C H H H H H H H H H H H H H H H
charge: -0.469199 -0.286165 -0.263538 -0.313761 -0.095109 -0.248108 0.121274 0.426625 -0.521452 -0.411121 0.137401 -0.585129 0.026551 0.222030 -0.616711 -0.199100 -0.505630 0.239626 0.212917 0.231396 0.230462 0.207876 0.259877 0.231790 0.215407 0.213933 0.361049 0.226065 0.241196 0.251561 0.225432 0.232554
chargesum: 0.00000
title: Mulliken charges with hydrogens summed into heavy atoms:
elementType: O O O O N C C C C C C C C C C C C
charge: -0.108150 -0.286165 -0.263538 -0.313761 -0.095109 -0.008482 0.121274 0.426625 -0.077138 0.027217 0.137401 -0.325252 0.026551 0.222030 0.044420 0.268160 0.203918
polarizability: 2.00295142e+02 -3.69717141e+00 1.61012009e+02 -6.87987113e-01 -4.10093419e-01 8.93008311e+01
1716.lowfreq: -10.0948 -3.6434 0.0006 0.0007 0.0009 5.6936 42.1847 60.6418 86.7732
frequency: 42.1369 60.6355 86.7676 116.0365 131.4746 155.7147 165.4852 174.7095 190.2955 200.1265 221.7145 246.4095 258.7628 302.1456 321.6513 340.1896 341.4245 398.7441 434.8802 461.9361 492.8438 525.3481 533.4650 552.7303 607.2321 618.2259 684.2549 707.3887 717.1742 761.5661 786.3996 825.9456 835.2119 847.8001 861.5278 918.5702 940.9273 964.7727 984.7801 1016.2641 1048.3718 1066.4191 1076.2188 1078.0689 1112.5666 1114.1346 1138.4567 1148.3064 1163.9104 1173.4071 1178.5341 1191.5240 1218.0900 1250.7038 1281.8656 1287.2715 1311.3424 1331.0724 1342.8192 1360.5892 1381.4360 1417.6517 1422.6975 1437.5899 1441.6412 1453.5321 1458.2870 1460.1474 1462.4092 1468.6581 1479.0605 1480.6503 1492.1767 1617.1863 1627.1082 2928.0558 2942.4992 2975.2870 2975.8269 2980.2370 2991.6123 3030.1113 3035.4794 3045.8616 3072.2920 3096.8306 3119.8870 3132.4553 3168.9267 3514.6734
redmass: 2.7786 3.5249 4.8638 2.7488 1.9591 2.6160 3.0541 1.9017 1.6021 2.4748 3.9976 5.3760 2.4257 4.9931 3.8130 4.0964 4.6752 4.5884 1.1229 4.4126 3.4747 4.3577 5.6518 4.8480 5.1991 5.8431 8.2964 5.1340 6.6489 5.3421 2.8841 6.5932 4.1157 5.0412 1.6554 7.1047 2.5484 3.0541 5.0936 3.3296 1.7292 2.2452 3.4569 1.5695 1.3151 1.2511 1.0935 1.6956 1.6190 1.4290 1.4135 2.9614 1.4013 1.6829 2.0468 1.8591 1.6846 2.0548 1.5018 1.2903 1.6182 2.0896 3.7824 1.2105 1.3428 1.5573 1.7512 1.1058 1.3806 1.0623 1.1578 1.1227 1.0870 9.4825 9.2903 1.0673 1.0414 1.0812 1.0644 1.0646 1.0310 1.0927 1.0976 1.0951 1.1004 1.1029 1.1056 1.1046 1.0930 1.0652
irintensity: 2.3882 2.7792 1.9411 8.3039 4.1746 8.3651 6.0209 5.5422 4.2483 0.2258 2.4691 0.5370 10.6133 1.0356 1.8742 1.2321 3.6768 5.1123 147.4298 5.0872 6.6465 4.5306 3.4737 8.7825 4.0640 8.0980 0.5195 2.4330 0.7887 25.8396 43.4484 53.8098 8.4348 43.6628 27.7748 15.5532 12.4949 59.4975 182.9976 23.6998 12.1999 86.5012 33.2371 16.2447 14.6233 1.7161 6.1686 15.9629 17.6571 90.9291 8.4860 27.8223 1.1943 36.4277 62.1359 68.4978 26.2441 45.9401 15.1113 9.8201 64.5186 19.7493 9.4640 23.3832 11.2518 11.9985 91.3190 15.6675 42.0406 26.1726 1.9855 17.5900 30.1500 60.6755 41.9597 51.8742 115.3951 44.1460 20.0439 127.1454 60.8727 43.0261 33.1101 42.3405 38.8720 29.2916 27.7081 18.5109 2.7887 7.6063
temp: 298.150 k
press: 1.00000 atm
elementType: 8 8 8 8 7 6 6 6 6 6 6 6 6 6 6 6 6 1 1 1 1 1 1 1 1 1 1 1 1 1 1 1
symmnumber: 1
zpe: 668817.8 jmol-1
zpe.correction: 0.254739 hartree
zpe.thermalcorrener: 0.270826 hartree
zpe.thermalcorrenthalpy: 0.271770 hartree
zpe.thermalcorrgfe: 0.211749 hartree
zpe.sumelectzpe: -820.581763 hartree
zpe.sumelectthermal: -820.565677 hartree
zpe.sumelectthermalent: -820.564733 hartree
zpe.sumelectthermalfe: -820.624754 hartree
dipole: -2.3434 0.7229 -1.6632
dipole: 2.9632
quadrupole: -87.8497 -91.3526 -103.4778
quadrupole: -9.0450 -0.2689 -2.9576
quadrupole: 6.3770 2.8741 -9.2511 -9.0450 -0.2689 -2.9576
hfenergy: -820.8365027 hartree
pointgroup: C01 [X(C12H15N1O4)]
dipole: -0.937855 0.3602112 -0.5914437 debye
polarizability: 199.5715346|-5.1235512|161.2058266|-6.1843609|3.9761733|89.8306209 unknown
InChI: InChI=1S/C12H15NO4/c1-13-4-3-7-5-8-10(17-6-16-8)11(15-2)9(7)12(13)14/h5,12,14H,3-4,6H2,1-2H3
charge 0 multiplicity 1
32 atoms
O  2.339477 1.373247 1.291957
O  -3.028242 0.848324 0.487359
O  -3.210023 -1.528751 0.353505
O  -0.224679 2.257789 0.325423
N  3.083808 -0.168225 -0.412867
C  2.024207 0.736269 -0.050126
C  0.667555 0.044403 0.030952
C  0.536452 -1.36577 -0.005333
C  1.782373 -2.229167 -0.141209
C  3.043788 -1.465486 0.29938
C  -0.482942 0.881739 0.189795
C  -0.745993 -1.979914 0.073666
C  -1.741051 0.264888 0.253565
C  -1.850847 -1.139831 0.186945
C  4.415108 0.456674 -0.518093
C  -3.975935 -0.267912 0.232207
C  -1.328242 3.211277 0.097457
H  1.983529 1.563031 -0.788285
H  1.66625 -3.154305 0.455083
H  1.906131 -2.531595 -1.2002
H  3.051986 -1.327028 1.404295
H  3.947444 -2.037994 0.02278
H  -0.857565 -3.067101 0.053569
H  4.840896 0.744571 0.466523
H  4.340342 1.371289 -1.134063
H  5.108301 -0.241782 -1.021501
H  1.64226 2.067731 1.436393
H  -4.368845 -0.179792 -0.800547
H  -4.763213 -0.247443 0.99947
H  -2.123222 3.085486 0.850545
H  -1.752369 3.07644 -0.913873
H  -0.864338 4.205036 0.185325
