program: Gaussian 09
title: 000051992
version: EM64L-G09RevD.01
frameworkgroup: C1[X(C14H15NO2)]
method: RPBEPBE
basis: SDD
operation: Freq
keyword: #p
keyword: freq=noraman
keyword: PBEPBE/SDD
title: #p freq=noraman PBEPBE/SDD
converged: YES YES NO NO
title: Mulliken charges:
elementType: O O N C C C C C C C C C C C C C C H H H H H H H H H H H H H H H
charge: -0.206279 -0.257943 -0.006873 -0.280560 -0.426524 -0.407185 0.084466 -0.397543 -0.529741 0.064621 0.247931 -0.026970 -0.477479 -0.347591 0.320012 -0.349415 -0.536209 0.259005 0.252435 0.216029 0.194268 0.223306 0.213938 0.214085 0.213761 0.244826 0.297054 0.262433 0.247681 0.222752 0.222333 0.249375
chargesum: 0.00000
title: Mulliken charges with hydrogens summed into heavy atoms:
elementType: O O N C C C C C C C C C C C C C C
charge: -0.206279 -0.257943 -0.006873 -0.021554 0.041939 0.010389 0.084466 0.030480 -0.071154 0.064621 0.247931 -0.026970 -0.180425 -0.085158 0.320012 -0.101735 0.158251
polarizability: 2.72177056e+02 -4.11448917e+00 1.58462250e+02 7.39637578e+00 -1.97764522e+00 9.30216078e+01
1716.lowfreq: -13.5790 -4.4160 -0.0006 -0.0006 0.0004 11.1075 31.7457 67.1071 87.4010
frequency: 31.7080 67.0560 87.3981 121.5106 149.9231 170.4034 205.1293 223.7893 251.9454 270.3616 274.6797 303.5736 329.6966 396.1545 421.7324 434.9903 445.3437 482.3312 511.5278 514.8095 553.1983 578.7750 602.3787 666.8350 679.6266 715.3163 752.0926 784.0994 803.8245 831.2810 842.2496 863.9728 876.4567 891.9127 920.2378 930.4996 960.7783 962.0277 996.8169 1035.3653 1054.7914 1061.9559 1087.3937 1093.1724 1111.3068 1118.5715 1135.5534 1154.6650 1188.5311 1195.9016 1210.8275 1221.2855 1244.0528 1250.6912 1259.0540 1273.8837 1298.2553 1309.9020 1333.6458 1339.9747 1345.1798 1382.9952 1430.4559 1436.1256 1449.0873 1462.5593 1464.1357 1464.5521 1468.2912 1473.2677 1473.7363 1557.8970 1573.4047 1597.3947 1627.1668 2959.0069 2961.2392 2965.4328 2972.0703 2983.5233 2989.3488 3036.0238 3048.2996 3050.6552 3066.7389 3074.3256 3128.4656 3151.2400 3165.6311 3171.5705
redmass: 4.3681 3.4719 3.6264 3.1437 4.8690 4.0875 1.9348 4.0536 1.6310 2.8884 4.0217 2.6217 3.8373 3.6239 4.0065 3.3361 4.2692 3.5424 6.0242 4.3892 3.3104 3.7250 4.4143 3.1764 6.1207 5.4747 4.4208 2.1418 3.4572 1.5116 1.8779 4.0363 2.8602 1.6155 2.1830 1.8356 1.4351 2.4187 4.0953 2.1167 2.6593 1.6664 1.3420 1.9553 1.2595 1.6496 1.8592 1.4779 1.7104 2.4567 1.5372 1.7037 1.8345 1.3732 1.4412 2.2835 1.3841 1.4274 1.4917 1.4779 2.1608 7.0089 1.9918 1.8888 1.1026 1.0912 1.2721 1.7096 1.0582 1.1277 1.1277 6.5722 10.8831 9.0857 7.8877 1.0749 1.0330 1.0714 1.0628 1.0617 1.0629 1.0970 1.1019 1.1042 1.1020 1.0955 1.0994 1.0876 1.0920 1.0964
irintensity: 4.5943 0.1415 2.7584 0.6915 2.6744 1.3681 5.0352 1.6794 4.3924 2.0143 4.0421 2.5192 1.8516 0.1387 0.7925 1.3942 0.7176 0.1477 4.2053 0.1314 6.4887 5.1669 19.9564 11.9268 3.7152 8.9649 2.6941 0.0996 4.3619 45.1690 7.7423 2.7415 2.2793 16.2570 9.9006 13.0076 3.5642 3.4245 69.9446 13.0137 17.8612 16.6957 4.5012 2.9375 0.1382 5.1705 16.4871 0.0868 37.9943 32.5692 10.6359 0.7885 27.0171 0.2688 24.3176 244.0095 4.4319 18.3966 16.2082 1.5292 21.2352 5.5714 69.2422 19.6261 13.5003 12.5747 25.7835 156.7970 14.2573 5.3194 3.5657 73.4618 149.2115 97.7618 64.2566 3.8975 81.7054 23.6294 37.3460 40.6506 17.6317 56.7974 56.0563 47.4007 27.5086 21.1423 23.5857 7.5754 2.0271 13.5026
temp: 298.150 k
press: 1.00000 atm
elementType: 8 8 7 6 6 6 6 6 6 6 6 6 6 6 6 6 6 1 1 1 1 1 1 1 1 1 1 1 1 1 1 1
symmnumber: 1
zpe: 680765.1 jmol-1
zpe.correction: 0.259290 hartree
zpe.thermalcorrener: 0.273723 hartree
zpe.thermalcorrenthalpy: 0.274667 hartree
zpe.thermalcorrgfe: 0.217844 hartree
zpe.sumelectzpe: -746.447396 hartree
zpe.sumelectthermal: -746.432963 hartree
zpe.sumelectthermalent: -746.432018 hartree
zpe.sumelectthermalfe: -746.488842 hartree
dipole: 0.4796 -2.7461 0.7123
dipole: 2.8773
quadrupole: -68.0809 -110.7493 -99.8708
quadrupole: -7.9859 2.2713 0.7873
quadrupole: 24.8194 -17.8489 -6.9705 -7.9859 2.2713 0.7873
hfenergy: -746.7066859 hartree
pointgroup: C01 [X(C14H15N1O2)]
dipole: 0.1854626 -1.0749195 0.3026365 debye
polarizability: 272.1109984|-4.1928732|158.3726692|8.0353732|-3.3283086|93.1772466 unknown
InChI: InChI=1S/C14H15NO2/c1-17-9-6-7-13-11(8-9)14(16)10-4-2-3-5-12(10)15-13/h6-8,10H,2-5H2,1H3
charge 0 multiplicity 1
32 atoms
O  -0.406141 2.592432 -0.527499
O  4.293672 0.729543 0.172451
N  -0.860463 -1.602782 -0.229677
C  -1.906523 0.67846 -0.48359
C  -2.839287 1.253662 0.64357
C  -4.26009 0.659509 0.53661
C  -1.919847 -0.84351 -0.410127
C  -4.23504 -0.885887 0.600286
C  -3.29003 -1.48161 -0.484686
C  -0.523039 1.334244 -0.416361
C  0.638501 0.430453 -0.210303
C  0.421506 -0.986726 -0.131726
C  1.941631 0.961886 -0.106132
C  1.540974 -1.831857 0.051233
C  3.045504 0.100721 0.078533
C  2.843916 -1.305635 0.157264
C  5.473742 -0.119891 0.360059
H  -2.367873 0.989397 -1.445629
H  -2.84872 2.353901 0.546798
H  -2.402361 1.008408 1.631791
H  -4.722162 0.98364 -0.418633
H  -4.891809 1.06238 1.351342
H  -5.253965 -1.295386 0.466606
H  -3.883004 -1.208107 1.600332
H  -3.732655 -1.284914 -1.483966
H  -3.18384 -2.573293 -0.368654
H  2.090872 2.044033 -0.170457
H  1.364197 -2.910137 0.107807
H  3.687441 -1.987842 0.298981
H  5.607856 -0.816012 -0.490554
H  5.411408 -0.692473 1.305804
H  6.322128 0.578192 0.404828
